program: Orca
programVersion: 5.0.2
elementType: O O O C C C C C C C C C C C C C C C C C C C H H H H H H H H H H H H H H H H H H H H H H H H H H
charge: 0
multiplicity: 1
keywords: wb97x-d3
keywords: def2-TZVPP
keywords: def2/J RIJCOSX
keywords: DEFGRID2
keywords: scfconv7
keywords: smallprint printgap noloewdin
keywords: NOSOSCF
formula: C19H26O3
InChI: InChI=1/C19H26O3/c1-7-8-13-12(4)16(10-15(13)20)22-18(21)17-14(9-11(2)3)19(17,5)6/h7,9,14,16-17H,1,8,10H2,2-6H3
48 atoms
O  0.308831 1.814531 0.187282
O  0.288209 -0.218337 -0.749039
O  4.484184 0.619859 -1.653483
C  -2.651157 0.712201 -1.49776
C  -2.682602 -0.288608 -0.383139
C  -1.768962 0.917604 -0.276877
C  -2.047817 0.294303 -2.815713
C  -3.786234 1.694384 -1.655091
C  -3.809693 -0.405128 0.564228
C  -0.307679 0.744768 -0.323202
C  -4.437773 -1.532021 0.916617
C  1.734853 1.841645 0.277436
C  -5.550094 -1.506763 1.921304
C  -4.118304 -2.893784 0.380095
C  2.493042 1.867972 -1.045972
C  2.322826 0.687754 1.04689
C  3.406548 0.185859 0.433603
C  3.591363 0.847982 -0.858474
C  1.742337 0.264222 2.342585
C  4.277449 -0.934953 0.905309
C  3.657518 -2.25756 0.561513
C  3.24802 -3.149503 1.455299
H  -2.164751 -1.213661 -0.613301
H  -2.10157 1.708407 0.386582
H  -1.307539 -0.496921 -2.719278
H  -2.835694 -0.077805 -3.473198
H  -1.576113 1.141408 -3.317648
H  -4.178359 2.046003 -0.701872
H  -3.456575 2.569231 -2.218273
H  -4.610033 1.238554 -2.207721
H  -4.14331 0.521574 1.022516
H  1.921396 2.758687 0.840118
H  -6.47859 -1.888629 1.489002
H  -5.319899 -2.150728 2.774067
H  -5.741485 -0.502982 2.299986
H  -3.778146 -3.554349 1.181584
H  -5.015492 -3.357016 -0.037342
H  -3.357082 -2.894614 -0.397112
H  2.919556 2.848449 -1.261146
H  1.874087 1.596405 -1.9026
H  1.411617 1.123788 2.92682
H  2.449405 -0.310755 2.937735
H  0.864839 -0.367469 2.180578
H  5.259895 -0.852036 0.432992
H  4.435028 -0.86738 1.983468
H  3.529816 -2.462223 -0.497487
H  2.791225 -4.083093 1.152985
H  3.352918 -2.97959 2.520773
elementType: O C H
totalener: -965.41622640 hartree
nucrepener: 1824.08320447 hartree
electener: -2789.49943087 hartree
oneelecener: -4935.05148813 hartree
twoeener: 2145.55205726 hartree
cpcmener: -0.03851180 hartree
kineticenergy: 960.99928238 hartree
xcener: -95.143065288874 hartree
chargesum: -0.0000000
charge: -0.298692 -0.496222 -0.493031 0.110776 0.042919 -0.126093 -0.278186 -0.269371 -0.289274 0.421807 -0.045596 0.285964 -0.219960 -0.254886 -0.151595 -0.002685 -0.123117 0.311109 -0.269725 -0.105710 -0.181010 -0.289871 0.092507 0.088690 0.091364 0.098333 0.099612 0.089021 0.098836 0.097532 0.121695 0.119255 0.094237 0.093423 0.089132 0.098297 0.095359 0.090831 0.111547 0.113527 0.121452 0.106073 0.118635 0.094949 0.105366 0.144725 0.132315 0.115735
qa: -0.2987 -0.4962 -0.4930 0.1108 0.0429 -0.1261 -0.2782 -0.2694 -0.2893 0.4218 -0.0456 0.2860 -0.2200 -0.2549 -0.1516 -0.0027 -0.1231 0.3111 -0.2697 -0.1057 -0.1810 -0.2899 0.0925 0.0887 0.0914 0.0983 0.0996 0.0890 0.0988 0.0975 0.1217 0.1193 0.0942 0.0934 0.0891 0.0983 0.0954 0.0908 0.1115 0.1135 0.1215 0.1061 0.1186 0.0949 0.1054 0.1447 0.1323 0.1157
va: 2.1335 2.0074 2.0000 3.6924 3.7630 3.8704 3.9054 3.9062 3.8743 4.1407 3.7516 3.7669 3.9210 3.9427 3.8717 3.6765 3.4700 4.0408 3.9338 3.8715 3.7832 3.9413 1.0327 1.0403 1.0184 1.0003 0.9996 1.0054 1.0016 1.0020 1.0100 0.9915 0.9963 0.9958 1.0088 0.9962 0.9973 1.0091 1.0217 1.0252 1.0034 1.0018 0.9981 1.0237 1.0068 1.0025 1.0033 1.0090
dispcorr: -0.023111505 hartree
energy: -965.439337902236
dipole: -23.58198 21.34742 -2.23456 -9.00958 10.04677 1.03719 5.03690 -3.16090 1.87600
magnitude: 3.09652 au
magnitude: 7.87073 debye
