program: Orca
programVersion: 5.0.2
elementType: O O O C C C C C C C C C C C C C C C C C C C H H H H H H H H H H H H H H H H H H H H H H H H H H
charge: 0
multiplicity: 1
keywords: wb97x-d3
keywords: def2-TZVPP
keywords: def2/J RIJCOSX
keywords: DEFGRID2
keywords: scfconv7
keywords: smallprint printgap noloewdin
keywords: NOSOSCF
formula: C19H26O3
InChI: InChI=1/C19H26O3/c1-7-8-13-12(4)16(10-15(13)20)22-18(21)17-14(9-11(2)3)19(17,5)6/h7,9,14,16-17H,1,8,10H2,2-6H3
48 atoms
O  0.142545 0.303404 0.088182
O  -0.916324 -0.028223 2.037335
O  4.21931 2.23335 -0.810281
C  -2.743629 -1.855319 0.230334
C  -3.422383 -0.554913 0.48108
C  -1.996198 -0.553633 -0.034421
C  -2.375621 -2.728339 1.403736
C  -3.099168 -2.643316 -1.006569
C  -4.521902 -0.051367 -0.383109
C  -0.902693 -0.081429 0.827613
C  -4.696931 1.22466 -0.736199
C  1.314294 0.826079 0.721311
C  -5.849402 1.646303 -1.595526
C  -3.774265 2.329702 -0.323773
C  1.907986 1.943215 -0.125057
C  2.390873 -0.229543 0.791035
C  3.543079 0.204591 0.254529
C  3.354208 1.549984 -0.297267
C  2.119391 -1.538914 1.429976
C  4.852977 -0.504373 0.131359
C  4.994117 -1.094819 -1.242001
C  5.84962 -0.668981 -2.163146
H  -3.503972 -0.292174 1.533435
H  -1.871947 -0.31202 -1.083674
H  -2.237666 -2.170825 2.327139
H  -3.173316 -3.452575 1.579324
H  -1.461395 -3.291313 1.20668
H  -3.30501 -2.004416 -1.864888
H  -2.280889 -3.311304 -1.280419
H  -3.981959 -3.260009 -0.829007
H  -5.245197 -0.786561 -0.725662
H  1.071314 1.174769 1.727236
H  -6.47624 0.804124 -1.887566
H  -6.478454 2.373397 -1.075987
H  -5.498191 2.139127 -2.505678
H  -3.270695 2.755755 -1.195721
H  -4.336475 3.146616 0.134853
H  -3.009432 2.014222 0.383175
H  1.818278 2.927165 0.335378
H  1.432013 1.996418 -1.106795
H  1.745187 -1.401415 2.446622
H  3.005152 -2.169383 1.471243
H  1.347624 -2.085913 0.881839
H  5.669797 0.19558 0.323905
H  4.923557 -1.293802 0.883011
H  4.316083 -1.911228 -1.47408
H  5.894076 -1.125634 -3.14391
H  6.535232 0.148731 -1.972794
elementType: O C H
totalener: -965.41732233 hartree
nucrepener: 1798.31286814 hartree
electener: -2763.73019047 hartree
oneelecener: -4882.79779541 hartree
twoeener: 2119.06760494 hartree
cpcmener: -0.03576510 hartree
kineticenergy: 960.99512226 hartree
xcener: -95.139696568405 hartree
chargesum: -0.0000000
charge: -0.296344 -0.500489 -0.485387 0.154026 -0.014854 -0.109125 -0.285000 -0.285327 -0.303025 0.402791 -0.013495 0.250187 -0.229845 -0.242443 -0.140717 -0.029216 -0.073331 0.308454 -0.252279 -0.104885 -0.178118 -0.285938 0.104860 0.094965 0.092921 0.098565 0.097002 0.094017 0.098204 0.099147 0.123816 0.106442 0.090159 0.097060 0.095248 0.101404 0.102225 0.081855 0.101812 0.103014 0.115749 0.106071 0.112294 0.096727 0.110901 0.144287 0.131728 0.113884
qa: -0.2963 -0.5005 -0.4854 0.1540 -0.0149 -0.1091 -0.2850 -0.2853 -0.3030 0.4028 -0.0135 0.2502 -0.2298 -0.2424 -0.1407 -0.0292 -0.0733 0.3085 -0.2523 -0.1049 -0.1781 -0.2859 0.1049 0.0950 0.0929 0.0986 0.0970 0.0940 0.0982 0.0991 0.1238 0.1064 0.0902 0.0971 0.0952 0.1014 0.1022 0.0819 0.1018 0.1030 0.1157 0.1061 0.1123 0.0967 0.1109 0.1443 0.1317 0.1139
va: 2.1164 1.9950 2.0063 3.6884 3.8166 3.8349 3.8920 3.9067 3.8921 4.1211 3.7071 3.7604 3.9308 3.9359 3.9272 3.7581 3.4522 4.0437 3.9365 3.8600 3.7812 3.9462 1.0239 1.0307 1.0174 1.0017 1.0007 1.0023 1.0025 0.9999 1.0034 1.0283 1.0062 0.9961 0.9963 0.9982 0.9994 1.0131 1.0232 1.0290 1.0040 1.0066 0.9993 1.0195 1.0066 1.0003 1.0027 1.0136
dispcorr: -0.023122219 hartree
energy: -965.440444548285
dipole: -17.17797 15.61820 -1.55976 -8.38299 7.02058 -1.36241 -4.30150 4.32157 0.02007
magnitude: 2.07109 au
magnitude: 5.26430 debye
