program: Orca
programVersion: 5.0.2
elementType: O O O C C C C C C C C C C C C C C C C C C C H H H H H H H H H H H H H H H H H H H H H H H H H H
charge: 0
multiplicity: 1
keywords: wb97x-d3
keywords: def2-TZVPP
keywords: def2/J RIJCOSX
keywords: DEFGRID2
keywords: scfconv7
keywords: smallprint printgap noloewdin
keywords: NOSOSCF
formula: C19H26O3
InChI: InChI=1/C19H26O3/c1-7-8-13-12(4)16(10-15(13)20)22-18(21)17-14(9-11(2)3)19(17,5)6/h7,9,14,16-17H,1,8,10H2,2-6H3
48 atoms
O  0.240077 1.83284 -0.299015
O  0.318954 -0.353704 -0.763098
O  4.537425 0.349477 -1.544666
C  -2.584902 0.155732 -1.832044
C  -2.654564 -0.437314 -0.460169
C  -1.783927 0.788748 -0.706994
C  -1.898452 -0.629847 -2.922264
C  -3.732039 0.98729 -2.355015
C  -3.836921 -0.310726 0.411612
C  -0.322928 0.660233 -0.607533
C  -4.255604 -1.194414 1.324234
C  1.655771 1.905825 -0.111369
C  -5.489211 -0.927532 2.133283
C  -3.582751 -2.496532 1.633841
C  2.508938 1.66634 -1.353036
C  2.188086 0.948176 0.923065
C  3.314038 0.346158 0.507073
C  3.589781 0.724689 -0.878877
C  1.514527 0.790348 2.233393
C  4.144737 -0.641207 1.263401
C  3.531611 -2.008702 1.189992
C  3.082018 -2.687195 2.238702
H  -2.086412 -1.354767 -0.35298
H  -2.177813 1.732012 -0.346377
H  -1.159118 -1.334648 -2.549212
H  -2.644127 -1.204584 -3.474742
H  -1.406061 0.03526 -3.634461
H  -4.527667 0.344468 -2.736564
H  -4.164592 1.643033 -1.600943
H  -3.393919 1.617989 -3.179062
H  -4.41745 0.599599 0.296775
H  1.797326 2.92378 0.257413
H  -5.969613 0.010486 1.85621
H  -6.220226 -1.730894 2.010732
H  -5.255504 -0.885239 3.20034
H  -3.401596 -2.584905 2.706917
H  -4.228415 -3.334597 1.363082
H  -2.63115 -2.63441 1.126406
H  2.949798 2.586619 -1.738276
H  1.954728 1.212169 -2.176123
H  0.680921 0.088668 2.150742
H  1.102002 1.736348 2.583969
H  2.189051 0.401311 2.993924
H  5.152499 -0.664689 0.839987
H  4.244849 -0.335119 2.306842
H  3.447189 -2.44049 0.197032
H  2.638847 -3.668581 2.128589
H  3.147031 -2.290704 3.245555
elementType: O C H
totalener: -965.41603816 hartree
nucrepener: 1831.90733188 hartree
electener: -2797.32337005 hartree
oneelecener: -4950.69330682 hartree
twoeener: 2153.36993677 hartree
cpcmener: -0.03815568 hartree
kineticenergy: 961.00952741 hartree
xcener: -95.145770341599 hartree
chargesum: 0.0000000
charge: -0.303591 -0.497934 -0.494107 0.104350 0.021165 -0.093374 -0.275776 -0.281487 -0.280075 0.415559 -0.045003 0.292580 -0.220677 -0.255625 -0.153386 0.003916 -0.129489 0.311004 -0.274173 -0.104671 -0.180948 -0.289973 0.099377 0.088464 0.090393 0.097672 0.099706 0.099263 0.092073 0.097763 0.120276 0.119959 0.089350 0.093017 0.094235 0.094196 0.099747 0.090597 0.111022 0.112954 0.118940 0.121161 0.108154 0.094619 0.106013 0.144760 0.132341 0.115663
qa: -0.3036 -0.4979 -0.4941 0.1043 0.0212 -0.0934 -0.2758 -0.2815 -0.2801 0.4156 -0.0450 0.2926 -0.2207 -0.2556 -0.1534 0.0039 -0.1295 0.3110 -0.2742 -0.1047 -0.1809 -0.2900 0.0994 0.0885 0.0904 0.0977 0.0997 0.0993 0.0921 0.0978 0.1203 0.1200 0.0894 0.0930 0.0942 0.0942 0.0997 0.0906 0.1110 0.1130 0.1189 0.1212 0.1082 0.0946 0.1060 0.1448 0.1323 0.1157
va: 2.1319 2.0074 1.9999 3.7004 3.7898 3.8257 3.9020 3.9127 3.8863 4.1521 3.7552 3.7616 3.9202 3.9393 3.8738 3.6692 3.4768 4.0406 3.9354 3.8703 3.7839 3.9403 1.0241 1.0374 1.0199 0.9998 0.9993 1.0004 1.0069 1.0010 1.0108 0.9909 1.0085 0.9955 0.9965 0.9972 0.9960 1.0117 1.0216 1.0253 0.9976 1.0041 1.0008 1.0240 1.0068 1.0022 1.0033 1.0091
dispcorr: -0.023171537 hartree
energy: -965.439209701889
dipole: -22.92381 20.55747 -2.36634 -8.21275 9.54804 1.33529 7.18238 -5.64058 1.54180
magnitude: 3.12405 au
magnitude: 7.94071 debye
