program: Orca
programVersion: 5.0.2
elementType: O O O C C C C C C C C C C C C C C C C C C C H H H H H H H H H H H H H H H H H H H H H H H H H H
charge: 0
multiplicity: 1
keywords: wb97x-d3
keywords: def2-TZVPP
keywords: def2/J RIJCOSX
keywords: DEFGRID2
keywords: scfconv7
keywords: smallprint printgap noloewdin
keywords: NOSOSCF
formula: C19H26O3
InChI: InChI=1/C19H26O3/c1-7-8-13-12(4)16(10-15(13)20)22-18(21)17-14(9-11(2)3)19(17,5)6/h7,9,14,16-17H,1,8,10H2,2-6H3
48 atoms
O  0.278127 0.515172 -0.265068
O  -0.748799 -0.083462 1.636686
O  4.631587 1.999696 -0.821503
C  -2.715635 -1.379752 -0.470128
C  -3.3426 -0.173285 0.160654
C  -1.951707 -0.064255 -0.432444
C  -2.310552 -2.528166 0.421356
C  -3.170162 -1.833494 -1.835926
C  -4.449132 0.570161 -0.474546
C  -0.781162 0.112194 0.442674
C  -5.567579 1.000203 0.119531
C  1.536931 0.707064 0.385823
C  -6.606746 1.750422 -0.659287
C  -5.907266 0.796651 1.56456
C  2.278726 1.882493 -0.232586
C  2.437007 -0.484392 0.165273
C  3.636506 -0.112589 -0.311313
C  3.66081 1.34118 -0.501008
C  1.987461 -1.848941 0.528526
C  4.849848 -0.951309 -0.556497
C  5.756188 -0.908702 0.640038
C  6.937223 -0.303738 0.67114
H  -3.359128 -0.20547 1.244661
H  -1.874875 0.435932 -1.391565
H  -2.103401 -2.228869 1.446355
H  -3.119693 -3.260179 0.45601
H  -1.427103 -3.037319 0.029885
H  -2.405302 -2.457646 -2.301421
H  -4.079382 -2.43237 -1.754076
H  -3.375205 -1.006502 -2.513963
H  -4.329134 0.786035 -1.532358
H  1.384836 0.858068 1.456759
H  -6.325218 1.882111 -1.70389
H  -7.568225 1.231063 -0.631381
H  -6.780173 2.740175 -0.228741
H  -5.153086 0.247352 2.124327
H  -6.057542 1.758534 2.061839
H  -6.850835 0.253119 1.660797
H  2.309915 2.762829 0.408903
H  1.826638 2.180836 -1.181773
H  1.729135 -1.89348 1.588701
H  2.749573 -2.600083 0.332359
H  1.08878 -2.129844 -0.026047
H  4.554977 -1.982977 -0.761828
H  5.37824 -0.587306 -1.440597
H  5.377076 -1.395499 1.534367
H  7.542477 -0.292657 1.568712
H  7.344046 0.198633 -0.199213
elementType: O C H
totalener: -965.41902267 hartree
nucrepener: 1769.64029643 hartree
electener: -2735.05931910 hartree
oneelecener: -4825.43208225 hartree
twoeener: 2090.37276315 hartree
cpcmener: -0.03749318 hartree
kineticenergy: 960.98318907 hartree
xcener: -95.138779153469 hartree
chargesum: 0.0000000
charge: -0.292669 -0.493428 -0.486286 0.113812 0.036383 -0.089454 -0.283652 -0.271235 -0.287428 0.392735 -0.050676 0.242839 -0.218399 -0.251873 -0.135016 -0.021129 -0.073316 0.308278 -0.254732 -0.110126 -0.176295 -0.287521 0.093753 0.091227 0.093887 0.101612 0.095331 0.098092 0.097671 0.089588 0.121673 0.106857 0.089010 0.093405 0.093689 0.089836 0.096423 0.096636 0.098800 0.104261 0.116695 0.106638 0.113365 0.111636 0.098914 0.144824 0.131947 0.113421
qa: -0.2927 -0.4934 -0.4863 0.1138 0.0364 -0.0895 -0.2837 -0.2712 -0.2874 0.3927 -0.0507 0.2428 -0.2184 -0.2519 -0.1350 -0.0211 -0.0733 0.3083 -0.2547 -0.1101 -0.1763 -0.2875 0.0938 0.0912 0.0939 0.1016 0.0953 0.0981 0.0977 0.0896 0.1217 0.1069 0.0890 0.0934 0.0937 0.0898 0.0964 0.0966 0.0988 0.1043 0.1167 0.1066 0.1134 0.1116 0.0989 0.1448 0.1319 0.1134
va: 2.1255 2.0032 2.0045 3.6734 3.7866 3.8364 3.9027 3.9070 3.8709 4.1724 3.7600 3.7813 3.9195 3.9404 3.9344 3.7381 3.4620 4.0435 3.9326 3.8657 3.7750 3.9517 1.0309 1.0359 1.0165 1.0016 1.0011 1.0015 1.0015 1.0060 1.0100 1.0291 1.0086 0.9963 0.9962 1.0103 0.9967 0.9970 1.0250 1.0266 1.0017 1.0067 0.9991 1.0052 1.0192 0.9993 1.0028 1.0138
dispcorr: -0.022291869 hartree
energy: -965.441314542542
dipole: -21.85787 19.88885 -1.96902 -9.46824 7.98754 -1.48070 -0.12846 -0.20246 -0.33092
magnitude: 2.48576 au
magnitude: 6.31830 debye
