program: Orca
programVersion: 5.0.2
elementType: O O O C C C C C C C C C C C C C C C C C C C H H H H H H H H H H H H H H H H H H H H H H H H H H
charge: 0
multiplicity: 1
keywords: wb97x-d3
keywords: def2-TZVPP
keywords: def2/J RIJCOSX
keywords: DEFGRID2
keywords: scfconv7
keywords: smallprint printgap noloewdin
keywords: NOSOSCF
formula: C19H26O3
InChI: InChI=1/C19H26O3/c1-7-8-13-12(4)16(10-15(13)20)22-18(21)17-14(9-11(2)3)19(17,5)6/h7,9,14,16-17H,1,8,10H2,2-6H3
48 atoms
O  0.289001 0.246471 -0.022453
O  -0.851325 0.028883 1.896174
O  4.380392 2.193875 -0.833767
C  -2.744377 -1.767087 0.173201
C  -3.315775 -0.388485 0.228968
C  -1.859358 -0.585112 -0.186742
C  -2.548595 -2.518462 1.467571
C  -3.088115 -2.683546 -0.977385
C  -4.288437 0.130088 -0.751932
C  -0.790197 -0.088361 0.692807
C  -5.083992 1.193287 -0.589908
C  1.441277 0.789925 0.630479
C  -6.041848 1.604324 -1.667764
C  -5.11316 2.065537 0.627296
C  2.051425 1.897005 -0.216689
C  2.520693 -0.258814 0.745625
C  3.68391 0.170696 0.22942
C  3.503961 1.509773 -0.341644
C  2.233996 -1.553666 1.406619
C  5.003248 -0.527675 0.153842
C  5.22665 -1.07753 -1.225097
C  6.139288 -0.63007 -2.078148
H  -3.420328 -0.001877 1.236913
H  -1.652493 -0.48182 -1.245631
H  -2.448402 -1.869575 2.333857
H  -3.413535 -3.160725 1.643018
H  -1.66835 -3.1625 1.419646
H  -2.3428 -3.476563 -1.059726
H  -4.057439 -3.157836 -0.81329
H  -3.123858 -2.172045 -1.938231
H  -4.356291 -0.405158 -1.693882
H  1.171256 1.15241 1.624305
H  -6.013095 0.931246 -2.524274
H  -7.067835 1.629695 -1.291781
H  -5.820415 2.613902 -2.023529
H  -4.375813 1.799348 1.380957
H  -4.939345 3.107552 0.349733
H  -6.097959 2.03576 1.099176
H  1.943894 2.887583 0.22514
H  1.6027 1.9321 -1.212192
H  3.117474 -2.183427 1.485048
H  1.474985 -2.111469 0.853165
H  1.835328 -1.391394 2.409953
H  5.802814 0.171207 0.410311
H  5.040621 -1.337939 0.884862
H  4.562611 -1.882881 -1.524511
H  6.244549 -1.057846 -3.066861
H  6.814856 0.177558 -1.821294
elementType: O C H
totalener: -965.41845073 hartree
nucrepener: 1774.56904698 hartree
electener: -2739.98749772 hartree
oneelecener: -4835.40735746 hartree
twoeener: 2095.41985975 hartree
cpcmener: -0.03674627 hartree
kineticenergy: 960.99172297 hartree
xcener: -95.140312324419 hartree
chargesum: -0.0000000
charge: -0.298938 -0.500999 -0.485341 0.120567 -0.015391 -0.076345 -0.275793 -0.290982 -0.264626 0.409821 -0.034961 0.254444 -0.225031 -0.254954 -0.142435 -0.030380 -0.076188 0.307997 -0.248698 -0.102751 -0.177672 -0.286269 0.103051 0.092276 0.091755 0.097755 0.097015 0.098287 0.102005 0.092613 0.119459 0.107388 0.089332 0.093395 0.094790 0.088361 0.095144 0.097776 0.101647 0.103183 0.106105 0.111497 0.114626 0.097987 0.109871 0.144232 0.131617 0.113759
qa: -0.2989 -0.5010 -0.4853 0.1206 -0.0154 -0.0763 -0.2758 -0.2910 -0.2646 0.4098 -0.0350 0.2544 -0.2250 -0.2550 -0.1424 -0.0304 -0.0762 0.3080 -0.2487 -0.1028 -0.1777 -0.2863 0.1031 0.0923 0.0918 0.0978 0.0970 0.0983 0.1020 0.0926 0.1195 0.1074 0.0893 0.0934 0.0948 0.0884 0.0951 0.0978 0.1016 0.1032 0.1061 0.1115 0.1146 0.0980 0.1099 0.1442 0.1316 0.1138
va: 2.1225 1.9995 2.0064 3.7047 3.8312 3.8173 3.8949 3.9168 3.8949 4.1476 3.7486 3.7525 3.9233 3.9411 3.9324 3.7615 3.4472 4.0428 3.9370 3.8585 3.7789 3.9470 1.0185 1.0343 1.0192 1.0004 1.0004 1.0007 0.9997 1.0055 1.0101 1.0290 1.0082 0.9955 0.9961 1.0125 0.9970 0.9965 1.0235 1.0286 1.0065 1.0003 1.0035 1.0178 1.0077 1.0006 1.0028 1.0132
dispcorr: -0.021893640 hartree
energy: -965.440344374176
dipole: -20.05184 18.37620 -1.67565 -8.58338 7.11318 -1.47019 -2.14852 2.29332 0.14480
magnitude: 2.23388 au
magnitude: 5.67808 debye
