program: Orca
programVersion: 5.0.2
elementType: O O O C C C C C C C C C C C C C C C C C C C H H H H H H H H H H H H H H H H H H H H H H H H H H
charge: 0
multiplicity: 1
keywords: wb97x-d3
keywords: def2-TZVPP
keywords: def2/J RIJCOSX
keywords: DEFGRID2
keywords: scfconv7
keywords: smallprint printgap noloewdin
keywords: NOSOSCF
formula: C19H26O3
InChI: InChI=1/C19H26O3/c1-7-8-13-12(4)16(10-15(13)20)22-18(21)17-14(9-11(2)3)19(17,5)6/h7,9,14,16-17H,1,8,10H2,2-6H3
48 atoms
O  0.437225 0.344526 0.015455
O  -0.75783 0.188467 1.906773
O  4.477902 2.442004 -0.697196
C  -2.590388 -1.663778 0.180094
C  -3.174493 -0.285879 0.191691
C  -1.711639 -0.478627 -0.184291
C  -2.412963 -2.384017 1.494649
C  -2.915616 -2.606516 -0.954028
C  -4.112023 0.197204 -0.839292
C  -0.663749 0.037838 0.709769
C  -5.175842 0.985111 -0.648839
C  1.583006 0.875204 0.68888
C  -6.03509 1.39681 -1.807041
C  -5.623023 1.525786 0.674765
C  2.163567 2.051881 -0.081374
C  2.681405 -0.155556 0.713556
C  3.83426 0.334185 0.230677
C  3.623238 1.704721 -0.24462
C  2.424464 -1.514061 1.244693
C  5.146902 -0.357181 0.105851
C  5.311267 -1.133219 -1.169414
C  4.382712 -1.331777 -2.097191
H  -3.317186 0.120434 1.187088
H  -1.480035 -0.394794 -1.240053
H  -2.332945 -1.715403 2.347914
H  -3.275351 -3.02979 1.669785
H  -1.526655 -3.021343 1.476321
H  -3.884908 -3.080375 -0.787705
H  -2.946591 -2.115129 -1.925244
H  -2.16735 -3.398999 -1.012164
H  -3.902708 -0.120334 -1.856456
H  1.318671 1.157031 1.70976
H  -6.048427 2.484253 -1.917086
H  -5.692587 0.9671 -2.748063
H  -7.073037 1.09038 -1.653896
H  -4.969139 1.266078 1.504131
H  -5.695743 2.615133 0.637335
H  -6.624054 1.160989 0.916777
H  2.040279 3.006418 0.430415
H  1.706093 2.147552 -1.068795
H  1.935784 -1.463327 2.21959
H  3.337055 -2.098628 1.343498
H  1.748735 -2.061176 0.582896
H  5.956736 0.375042 0.173688
H  5.30356 -1.0364 0.948957
H  6.296598 -1.566229 -1.310969
H  4.600654 -1.914374 -2.982877
H  3.380336 -0.927891 -2.018299
elementType: O C H
totalener: -965.41886566 hartree
nucrepener: 1785.26888705 hartree
electener: -2750.68775270 hartree
oneelecener: -4856.67285512 hartree
twoeener: 2105.98510242 hartree
cpcmener: -0.03639703 hartree
kineticenergy: 960.99733412 hartree
xcener: -95.143203824841 hartree
chargesum: 0.0000000
charge: -0.301843 -0.498267 -0.484188 0.103979 0.026787 -0.091255 -0.274752 -0.275261 -0.278215 0.411855 -0.052555 0.264365 -0.218088 -0.252480 -0.146263 -0.029679 -0.104630 0.325068 -0.248046 -0.073838 -0.190543 -0.279186 0.098495 0.089982 0.091698 0.097216 0.097743 0.098247 0.090915 0.097604 0.120574 0.108754 0.094369 0.088692 0.093053 0.090011 0.095133 0.097865 0.102057 0.102898 0.117933 0.106894 0.113817 0.090751 0.105121 0.134169 0.133401 0.109641
qa: -0.3018 -0.4983 -0.4842 0.1040 0.0268 -0.0913 -0.2748 -0.2753 -0.2782 0.4119 -0.0526 0.2644 -0.2181 -0.2525 -0.1463 -0.0297 -0.1046 0.3251 -0.2480 -0.0738 -0.1905 -0.2792 0.0985 0.0900 0.0917 0.0972 0.0977 0.0982 0.0909 0.0976 0.1206 0.1088 0.0944 0.0887 0.0931 0.0900 0.0951 0.0979 0.1021 0.1029 0.1179 0.1069 0.1138 0.0908 0.1051 0.1342 0.1334 0.1096
va: 2.1224 2.0046 2.0128 3.6799 3.7971 3.8368 3.9006 3.9128 3.8783 4.1478 3.7637 3.7290 3.9191 3.9396 3.9128 3.7254 3.4632 4.0191 3.9315 3.8300 3.8381 3.8975 1.0266 1.0363 1.0193 1.0004 0.9998 1.0012 1.0065 1.0012 1.0110 1.0330 0.9962 1.0088 0.9959 1.0111 0.9969 0.9968 1.0238 1.0272 1.0053 1.0034 0.9992 1.0193 1.0003 1.0019 1.0040 1.0201
dispcorr: -0.022376126 hartree
energy: -965.441241783826
dipole: -22.11735 20.63473 -1.48262 -10.98114 9.30927 -1.67187 -2.71701 2.82492 0.10790
magnitude: 2.23718 au
magnitude: 5.68645 debye
