program: Orca
programVersion: 5.0.2
elementType: O O O C C C C C C C C C C C C C C C C C C C H H H H H H H H H H H H H H H H H H H H H H H H H H
charge: 0
multiplicity: 1
keywords: wb97x-d3
keywords: def2-TZVPP
keywords: def2/J RIJCOSX
keywords: DEFGRID2
keywords: scfconv7
keywords: smallprint printgap noloewdin
keywords: NOSOSCF
formula: C19H26O3
InChI: InChI=1/C19H26O3/c1-7-8-13-12(4)16(10-15(13)20)22-18(21)17-14(9-11(2)3)19(17,5)6/h7,9,14,16-17H,1,8,10H2,2-6H3
48 atoms
O  0.123066 0.427369 -0.184478
O  -0.711281 -0.552207 1.6519
O  4.259697 2.449979 -0.70016
C  -2.694925 -1.757716 -0.481538
C  -3.369343 -0.695847 0.313886
C  -2.033589 -0.390734 -0.334824
C  -2.127294 -2.963022 0.226532
C  -3.203082 -2.071673 -1.867546
C  -4.596887 -0.006048 -0.161613
C  -0.838893 -0.199862 0.500367
C  -4.893396 1.274264 0.075627
C  1.388686 0.667814 0.435725
C  -6.163413 1.888054 -0.426756
C  -4.000761 2.197854 0.844189
C  1.970904 1.991408 -0.036705
C  2.394671 -0.372434 0.011951
C  3.519737 0.189588 -0.458292
C  3.383504 1.648086 -0.438684
C  2.126225 -1.816364 0.205809
C  4.778228 -0.489643 -0.873813
C  5.702814 -0.822504 0.261026
C  5.450948 -0.674106 1.555627
H  -3.305768 -0.833996 1.390753
H  -2.062322 0.222084 -1.228421
H  -1.237167 -3.335793 -0.284496
H  -1.866627 -2.770368 1.26469
H  -2.866204 -3.766594 0.222808
H  -2.410467 -2.514156 -2.473231
H  -4.022238 -2.791887 -1.820436
H  -3.565084 -1.187908 -2.392228
H  -5.308234 -0.605382 -0.723148
H  1.28097 0.652121 1.52247
H  -6.771767 1.176737 -0.98474
H  -6.765906 2.27552 0.39859
H  -5.952481 2.738941 -1.079641
H  -4.535448 2.625965 1.695648
H  -3.102494 1.714535 1.223942
H  -3.691304 3.041539 0.221673
H  1.951691 2.769268 0.726132
H  1.436653 2.37301 -0.910135
H  2.944731 -2.436432 -0.153764
H  1.215906 -2.126205 -0.312312
H  1.97512 -2.03254 1.265675
H  4.551165 -1.412055 -1.415536
H  5.316591 0.135794 -1.590454
H  6.659897 -1.23465 -0.043202
H  6.186292 -0.956341 2.297586
H  4.517812 -0.269095 1.928584
elementType: O C H
totalener: -965.41739182 hartree
nucrepener: 1804.95940735 hartree
electener: -2770.37679917 hartree
oneelecener: -4895.98044232 hartree
twoeener: 2125.60364315 hartree
cpcmener: -0.03568875 hartree
kineticenergy: 961.00863498 hartree
xcener: -95.144849209832 hartree
chargesum: 0.0000000
charge: -0.295365 -0.498872 -0.485651 0.160091 -0.018890 -0.105184 -0.289337 -0.289917 -0.300737 0.395110 -0.014327 0.257849 -0.228581 -0.241663 -0.134169 -0.043158 -0.083622 0.321341 -0.251478 -0.082637 -0.188264 -0.281928 0.104737 0.095229 0.096514 0.095102 0.100558 0.098408 0.099905 0.094564 0.124246 0.105774 0.089930 0.096485 0.094953 0.101599 0.080521 0.099090 0.098406 0.103267 0.106061 0.117974 0.119062 0.104648 0.092335 0.134036 0.132919 0.113066
qa: -0.2954 -0.4989 -0.4857 0.1601 -0.0189 -0.1052 -0.2893 -0.2899 -0.3007 0.3951 -0.0143 0.2578 -0.2286 -0.2417 -0.1342 -0.0432 -0.0836 0.3213 -0.2515 -0.0826 -0.1883 -0.2819 0.1047 0.0952 0.0965 0.0951 0.1006 0.0984 0.0999 0.0946 0.1242 0.1058 0.0899 0.0965 0.0950 0.1016 0.0805 0.0991 0.0984 0.1033 0.1061 0.1180 0.1191 0.1046 0.0923 0.1340 0.1329 0.1131
va: 2.1194 1.9945 2.0100 3.6833 3.8250 3.8290 3.8891 3.9075 3.8896 4.1337 3.7058 3.7645 3.9293 3.9369 3.9235 3.7445 3.4490 4.0319 3.9293 3.8464 3.8282 3.9047 1.0245 1.0308 1.0005 1.0159 1.0026 1.0025 0.9994 1.0016 1.0030 1.0330 1.0061 0.9962 0.9964 0.9994 1.0145 0.9986 1.0247 1.0269 1.0049 1.0000 1.0002 0.9999 1.0190 1.0018 1.0042 1.0141
dispcorr: -0.023699792 hartree
energy: -965.441091607593
dipole: -18.22407 16.59994 -1.62413 -7.96263 6.61907 -1.34356 -1.42430 0.77086 -0.65344
magnitude: 2.20679 au
magnitude: 5.60922 debye
