program: Orca
programVersion: 5.0.2
elementType: O O O C C C C C C C C C C C C C C C C C C C H H H H H H H H H H H H H H H H H H H H H H H H H H
charge: 0
multiplicity: 1
keywords: wb97x-d3
keywords: def2-TZVPP
keywords: def2/J RIJCOSX
keywords: DEFGRID2
keywords: scfconv7
keywords: smallprint printgap noloewdin
keywords: NOSOSCF
formula: C19H26O3
InChI: InChI=1/C19H26O3/c1-7-8-13-12(4)16(10-15(13)20)22-18(21)17-14(9-11(2)3)19(17,5)6/h7,9,14,16-17H,1,8,10H2,2-6H3
48 atoms
O  0.507345 -0.28299 0.387829
O  -0.862088 0.672479 1.870306
O  3.968576 2.722632 0.077006
C  -2.822901 -1.48769 0.61023
C  -3.194634 -0.099274 0.183788
C  -1.761256 -0.568624 0.027668
C  -2.831039 -1.806773 2.084747
C  -3.20469 -2.669618 -0.247433
C  -4.001479 0.178009 -1.019676
C  -0.701322 0.013048 0.867908
C  -4.970412 1.093142 -1.137172
C  1.647487 0.202276 1.10479
C  -5.719008 1.251166 -2.427022
C  -5.415715 2.022141 -0.049094
C  1.928061 1.683153 0.879795
C  2.84917 -0.51523 0.55326
C  3.804219 0.339554 0.154806
C  3.33391 1.716688 0.329558
C  2.888497 -1.996062 0.514426
C  5.139106 0.000612 -0.429125
C  5.0142 -0.3817 -1.87441
C  5.361494 -1.563312 -2.369263
H  -3.340902 0.583612 1.01348
H  -1.442119 -0.829845 -0.975302
H  -2.653019 -0.93734 2.714044
H  -3.804853 -2.214211 2.362633
H  -2.079817 -2.560881 2.327299
H  -2.566578 -3.52458 -0.017325
H  -4.236951 -2.966736 -0.052228
H  -3.11054 -2.469552 -1.313624
H  -3.778809 -0.429372 -1.892175
H  1.535684 -0.035318 2.166501
H  -5.382178 0.54807 -3.188508
H  -6.791295 1.099896 -2.278079
H  -5.604273 2.262458 -2.825717
H  -4.825938 1.953073 0.862432
H  -5.376483 3.058819 -0.392315
H  -6.458089 1.827776 0.216274
H  1.859416 2.274833 1.792837
H  1.242864 2.125122 0.152759
H  2.298257 -2.371789 -0.324794
H  2.456552 -2.422335 1.420995
H  3.901876 -2.375752 0.39815
H  5.801554 0.865217 -0.334166
H  5.600534 -0.815604 0.130666
H  4.600869 0.375434 -2.534233
H  5.247565 -1.790692 -3.421368
H  5.776683 -2.344708 -1.742945
elementType: O C H
totalener: -965.41971258 hartree
nucrepener: 1770.75328030 hartree
electener: -2736.17299288 hartree
oneelecener: -4827.70071001 hartree
twoeener: 2091.52771713 hartree
cpcmener: -0.03643510 hartree
kineticenergy: 960.99793097 hartree
xcener: -95.140017194398 hartree
chargesum: -0.0000000
charge: -0.295389 -0.499633 -0.486892 0.100057 0.028714 -0.076784 -0.272255 -0.274754 -0.280539 0.408570 -0.052834 0.251883 -0.217450 -0.252789 -0.147941 -0.039307 -0.067576 0.324944 -0.277953 -0.095375 -0.183169 -0.287951 0.093197 0.090741 0.089690 0.098862 0.099957 0.097765 0.098261 0.090590 0.121377 0.107268 0.088215 0.093072 0.094088 0.091179 0.094542 0.098166 0.106061 0.106571 0.116825 0.119977 0.102504 0.094396 0.106872 0.145773 0.131862 0.116614
qa: -0.2954 -0.4996 -0.4869 0.1001 0.0287 -0.0768 -0.2723 -0.2748 -0.2805 0.4086 -0.0528 0.2519 -0.2174 -0.2528 -0.1479 -0.0393 -0.0676 0.3249 -0.2780 -0.0954 -0.1832 -0.2880 0.0932 0.0907 0.0897 0.0989 0.1000 0.0978 0.0983 0.0906 0.1214 0.1073 0.0882 0.0931 0.0941 0.0912 0.0945 0.0982 0.1061 0.1066 0.1168 0.1200 0.1025 0.0944 0.1069 0.1458 0.1319 0.1166
va: 2.1300 2.0054 2.0102 3.6973 3.7872 3.8344 3.9039 3.9109 3.8761 4.1428 3.7648 3.7577 3.9194 3.9393 3.9035 3.7523 3.4660 4.0289 3.9482 3.8474 3.7942 3.9380 1.0309 1.0345 1.0182 1.0000 0.9995 1.0016 1.0015 1.0063 1.0106 1.0164 1.0089 0.9956 0.9965 1.0103 0.9970 0.9964 1.0222 1.0231 0.9989 1.0023 1.0026 1.0251 1.0044 1.0021 1.0035 1.0088
dispcorr: -0.021684366 hartree
energy: -965.441396944786
dipole: -20.14303 19.07093 -1.07210 -10.98706 8.46517 -2.52190 -5.72123 5.47095 -0.25028
magnitude: 2.75173 au
magnitude: 6.99434 debye
