program: Orca
programVersion: 5.0.2
elementType: O O O C C C C C C C C C C C C C C C C C C C H H H H H H H H H H H H H H H H H H H H H H H H H H
charge: 0
multiplicity: 1
keywords: wb97x-d3
keywords: def2-TZVPP
keywords: def2/J RIJCOSX
keywords: DEFGRID2
keywords: scfconv7
keywords: smallprint printgap noloewdin
keywords: NOSOSCF
formula: C19H26O3
InChI: InChI=1/C19H26O3/c1-7-8-13-12(4)16(10-15(13)20)22-18(21)17-14(9-11(2)3)19(17,5)6/h7,9,14,16-17H,1,8,10H2,2-6H3
48 atoms
O  0.356431 1.698355 0.655298
O  0.317352 -0.099003 -0.677629
O  4.428141 1.078343 -1.638018
C  -2.64639 0.864039 -1.138978
C  -2.624335 -0.302184 -0.200633
C  -1.730542 0.884164 0.078111
C  -2.082995 0.692968 -2.527388
C  -3.815842 1.815617 -1.088066
C  -3.741207 -0.592682 0.731332
C  -0.270269 0.748336 -0.044262
C  -4.651315 -1.555899 0.56126
C  1.785145 1.744424 0.672767
C  -5.733567 -1.789355 1.571102
C  -4.683677 -2.468908 -0.624719
C  2.455696 2.087713 -0.653037
C  2.442481 0.466561 1.128036
C  3.488412 0.144153 0.349889
C  3.580214 1.087577 -0.764725
C  1.967943 -0.240144 2.340269
C  4.408001 -1.02662 0.500454
C  3.755253 -2.287186 0.015836
C  3.572539 -3.373028 0.757161
H  -2.10268 -1.171264 -0.590853
H  -2.055588 1.548593 0.87146
H  -1.644898 1.624032 -2.89208
H  -1.326315 -0.085581 -2.591802
H  -2.887695 0.420004 -3.212655
H  -4.177376 1.984618 -0.074205
H  -3.541867 2.784417 -1.509406
H  -4.648288 1.423246 -1.67577
H  -3.8141 0.03383 1.615777
H  1.992183 2.518374 1.41461
H  -6.722391 -1.688584 1.11662
H  -5.681829 -2.804547 1.972883
H  -5.672947 -1.092975 2.407218
H  -3.895489 -2.268646 -1.348268
H  -4.600128 -3.513598 -0.314506
H  -5.640467 -2.379424 -1.145445
H  2.849272 3.104827 -0.668152
H  1.788432 1.993797 -1.511453
H  1.776241 0.465599 3.150226
H  2.683944 -0.98216 2.687974
H  1.026129 -0.758864 2.144393
H  5.317899 -0.840844 -0.077009
H  4.713736 -1.14308 1.542273
H  3.411355 -2.280068 -1.014461
H  3.092447 -4.256727 0.356973
H  3.899691 -3.420438 1.789658
elementType: O C H
totalener: -965.41529469 hartree
nucrepener: 1821.14923407 hartree
electener: -2786.56452876 hartree
oneelecener: -4929.18632415 hartree
twoeener: 2142.62179539 hartree
cpcmener: -0.03778764 hartree
kineticenergy: 961.00469315 hartree
xcener: -95.143408659082 hartree
chargesum: 0.0000000
charge: -0.300909 -0.496243 -0.492937 0.153285 -0.007192 -0.144634 -0.299497 -0.269358 -0.272508 0.425490 -0.032332 0.290244 -0.230371 -0.251969 -0.153806 -0.005797 -0.128684 0.314398 -0.259970 -0.095400 -0.186188 -0.288923 0.099174 0.090178 0.102279 0.093601 0.097311 0.092299 0.099520 0.096486 0.124391 0.119879 0.094258 0.095695 0.090098 0.088069 0.098524 0.096651 0.110968 0.113013 0.121070 0.101692 0.118196 0.092719 0.104520 0.144511 0.132074 0.116127
qa: -0.3009 -0.4962 -0.4929 0.1533 -0.0072 -0.1446 -0.2995 -0.2694 -0.2725 0.4255 -0.0323 0.2902 -0.2304 -0.2520 -0.1538 -0.0058 -0.1287 0.3144 -0.2600 -0.0954 -0.1862 -0.2889 0.0992 0.0902 0.1023 0.0936 0.0973 0.0923 0.0995 0.0965 0.1244 0.1199 0.0943 0.0957 0.0901 0.0881 0.0985 0.0967 0.1110 0.1130 0.1211 0.1017 0.1182 0.0927 0.1045 0.1445 0.1321 0.1161
va: 2.1352 2.0080 2.0023 3.6667 3.7757 3.9213 3.9024 3.9046 3.8705 4.1452 3.7027 3.7617 3.9259 3.9435 3.8786 3.6767 3.4797 4.0400 3.9362 3.8635 3.7908 3.9377 1.0247 1.0405 0.9990 1.0181 1.0009 1.0024 1.0026 1.0025 1.0066 0.9913 0.9963 0.9950 1.0076 1.0081 0.9979 0.9974 1.0219 1.0245 1.0019 1.0030 0.9994 1.0254 1.0062 1.0025 1.0034 1.0090
dispcorr: -0.023469522 hartree
energy: -965.438764207239
dipole: -24.28464 22.05799 -2.22665 -9.65315 10.21925 0.56610 2.60039 -0.54314 2.05725
magnitude: 3.08395 au
magnitude: 7.83878 debye
