program: Orca
programVersion: 5.0.2
elementType: O O O C C C C C C C C C C C C C C C C C C C H H H H H H H H H H H H H H H H H H H H H H H H H H
charge: 0
multiplicity: 1
keywords: wb97x-d3
keywords: def2-TZVPP
keywords: def2/J RIJCOSX
keywords: DEFGRID2
keywords: scfconv7
keywords: smallprint printgap noloewdin
keywords: NOSOSCF
formula: C19H26O3
InChI: InChI=1/C19H26O3/c1-7-8-13-12(4)16(10-15(13)20)22-18(21)17-14(9-11(2)3)19(17,5)6/h7,9,14,16-17H,1,8,10H2,2-6H3
48 atoms
O  0.312093 -0.410003 0.539795
O  -1.00654 0.470523 2.112374
O  3.560386 2.790115 0.028267
C  -3.047904 -1.626703 0.857999
C  -3.385233 -0.229406 0.470421
C  -1.966905 -0.725891 0.272649
C  -3.027269 -1.996377 2.320022
C  -3.479492 -2.761782 -0.037752
C  -4.232958 0.09908 -0.705626
C  -0.880099 -0.161096 1.086554
C  -4.060576 1.163796 -1.493111
C  1.466549 0.131292 1.19095
C  -4.979802 1.444186 -2.64196
C  -2.953824 2.156029 -1.308806
C  1.646639 1.628421 0.965636
C  2.670639 -0.510673 0.557305
C  3.546124 0.400889 0.10495
C  3.006638 1.747275 0.31878
C  2.794381 -1.986477 0.511821
C  4.859138 0.149013 -0.567305
C  4.667799 -0.189318 -2.0168
C  5.045104 -1.333343 -2.574463
H  -3.487453 0.451099 1.312721
H  -1.679303 -0.970633 -0.743548
H  -2.789326 -1.157228 2.969817
H  -4.010273 -2.366795 2.615692
H  -2.306118 -2.791991 2.515287
H  -2.830043 -3.627214 0.102883
H  -4.498397 -3.072996 0.200181
H  -3.450129 -2.494338 -1.093699
H  -5.067948 -0.565993 -0.908241
H  1.435256 -0.121062 2.254345
H  -5.462993 2.41766 -2.526165
H  -4.427045 1.48513 -3.583858
H  -5.760341 0.689962 -2.739223
H  -2.293849 2.163413 -2.180698
H  -3.357074 3.168232 -1.221955
H  -2.342706 1.964763 -0.428515
H  1.611372 2.205873 1.889684
H  0.887321 2.038401 0.295443
H  2.503752 -2.428653 1.466702
H  3.806023 -2.308317 0.272028
H  2.125429 -2.404664 -0.244533
H  5.482549 1.043004 -0.478492
H  5.392732 -0.660938 -0.06564
H  4.178365 0.567904 -2.622794
H  4.877257 -1.531624 -3.625337
H  5.534393 -2.113504 -2.002943
elementType: O C H
totalener: -965.41809245 hartree
nucrepener: 1800.55626367 hartree
electener: -2765.97435612 hartree
oneelecener: -4887.28632822 hartree
twoeener: 2121.31197210 hartree
cpcmener: -0.03494615 hartree
kineticenergy: 960.99463486 hartree
xcener: -95.138370018820 hartree
chargesum: -0.0000000
charge: -0.296788 -0.502519 -0.486752 0.148079 -0.019441 -0.088815 -0.274871 -0.286267 -0.300884 0.396315 -0.013372 0.253722 -0.229037 -0.239092 -0.147234 -0.047541 -0.062265 0.324560 -0.270238 -0.098024 -0.183432 -0.287610 0.101984 0.094447 0.089641 0.097202 0.100282 0.098512 0.099381 0.093454 0.125018 0.107486 0.096270 0.095162 0.089780 0.100575 0.101930 0.076799 0.106687 0.105538 0.119976 0.100286 0.115371 0.095143 0.106318 0.146062 0.131875 0.116322
qa: -0.2968 -0.5025 -0.4868 0.1481 -0.0194 -0.0888 -0.2749 -0.2863 -0.3009 0.3963 -0.0134 0.2537 -0.2290 -0.2391 -0.1472 -0.0475 -0.0623 0.3246 -0.2702 -0.0980 -0.1834 -0.2876 0.1020 0.0944 0.0896 0.0972 0.1003 0.0985 0.0994 0.0935 0.1250 0.1075 0.0963 0.0952 0.0898 0.1006 0.1019 0.0768 0.1067 0.1055 0.1200 0.1003 0.1154 0.0951 0.1063 0.1461 0.1319 0.1163
va: 2.1244 1.9964 2.0102 3.7040 3.8144 3.8207 3.8931 3.9085 3.8894 4.1179 3.7076 3.7547 3.9302 3.9377 3.9024 3.7665 3.4559 4.0327 3.9479 3.8492 3.7939 3.9396 1.0280 1.0307 1.0172 1.0010 0.9994 1.0029 0.9999 1.0017 1.0032 1.0164 0.9961 0.9963 1.0060 0.9982 0.9999 1.0154 1.0220 1.0236 1.0013 1.0039 1.0003 1.0243 1.0044 1.0024 1.0033 1.0089
dispcorr: -0.022824089 hartree
energy: -965.440916542837
dipole: -15.06610 14.29425 -0.77186 -10.04617 7.63833 -2.40785 -8.15895 7.73631 -0.42264
magnitude: 2.56361 au
magnitude: 6.51618 debye
