program: Orca
programVersion: 5.0.2
elementType: O O O C C C C C C C C C C C C C C C C C C C H H H H H H H H H H H H H H H H H H H H H H H H H H
charge: 0
multiplicity: 1
keywords: wb97x-d3
keywords: def2-TZVPP
keywords: def2/J RIJCOSX
keywords: DEFGRID2
keywords: scfconv7
keywords: smallprint printgap noloewdin
keywords: NOSOSCF
formula: C19H26O3
InChI: InChI=1/C19H26O3/c1-7-8-13-12(4)16(10-15(13)20)22-18(21)17-14(9-11(2)3)19(17,5)6/h7,9,14,16-17H,1,8,10H2,2-6H3
48 atoms
O  0.369484 -0.393059 0.531087
O  -0.99494 0.524244 2.044203
O  3.69305 2.700676 -0.078812
C  -2.925681 -1.693512 0.761004
C  -3.341966 -0.300474 0.437654
C  -1.903346 -0.710316 0.203249
C  -2.860607 -2.123514 2.20461
C  -3.31052 -2.81093 -0.17783
C  -4.230138 0.027645 -0.7080
C  -0.837574 -0.127154 1.034823
C  -4.16039 1.149449 -1.429256
C  1.508511 0.167441 1.194473
C  -5.122864 1.423032 -2.543849
C  -3.134743 2.215953 -1.198818
C  1.727978 1.641495 0.873578
C  2.722616 -0.538048 0.654469
C  3.631031 0.323329 0.170203
C  3.110292 1.690322 0.265677
C  2.816816 -2.015332 0.709225
C  4.955136 0.0060 -0.43383
C  4.894123 -0.416482 -1.873727
C  3.798992 -0.607733 -2.599131
H  -3.469323 0.336847 1.310047
H  -1.61188 -0.902618 -0.823434
H  -2.645286 -1.303119 2.88634
H  -3.82037 -2.549307 2.503074
H  -2.100852 -2.894168 2.350194
H  -4.303849 -3.192797 0.066869
H  -3.322951 -2.495081 -1.221106
H  -2.607558 -3.641433 -0.092518
H  -5.011808 -0.689597 -0.942765
H  1.4295 -0.010437 2.270302
H  -5.837915 0.611819 -2.679415
H  -5.685416 2.341499 -2.356931
H  -4.595162 1.572904 -3.489117
H  -3.616888 3.182848 -1.032732
H  -2.486371 2.015822 -0.347463
H  -2.502142 2.33776 -2.082257
H  1.674926 2.282541 1.754076
H  0.998559 2.018284 0.152193
H  2.512598 -2.387002 1.68937
H  3.82381 -2.370385 0.497307
H  2.143794 -2.468854 -0.022028
H  5.616628 0.873082 -0.351905
H  5.450102 -0.786656 0.135942
H  5.862759 -0.582676 -2.334636
H  3.869935 -0.923415 -3.632054
H  2.800424 -0.462646 -2.204948
elementType: O C H
totalener: -965.41816895 hartree
nucrepener: 1811.85319864 hartree
electener: -2777.27136759 hartree
oneelecener: -4909.91565798 hartree
twoeener: 2132.64429039 hartree
cpcmener: -0.03617737 hartree
kineticenergy: 960.98641062 hartree
xcener: -95.138690156421 hartree
chargesum: -0.0000000
charge: -0.299912 -0.502577 -0.483962 0.151965 -0.025145 -0.094298 -0.271758 -0.289611 -0.296316 0.399147 -0.015656 0.268856 -0.228940 -0.240272 -0.154336 -0.048760 -0.094167 0.334647 -0.268221 -0.067217 -0.189319 -0.280612 0.101016 0.096542 0.090004 0.097733 0.100055 0.100265 0.093340 0.099065 0.124448 0.110493 0.089871 0.096066 0.095022 0.100890 0.077719 0.099740 0.106319 0.106580 0.120923 0.104492 0.113214 0.089409 0.106035 0.133991 0.133104 0.110126
qa: -0.2999 -0.5026 -0.4840 0.1520 -0.0251 -0.0943 -0.2718 -0.2896 -0.2963 0.3991 -0.0157 0.2689 -0.2289 -0.2403 -0.1543 -0.0488 -0.0942 0.3346 -0.2682 -0.0672 -0.1893 -0.2806 0.1010 0.0965 0.0900 0.0977 0.1001 0.1003 0.0933 0.0991 0.1244 0.1105 0.0899 0.0961 0.0950 0.1009 0.0777 0.0997 0.1063 0.1066 0.1209 0.1045 0.1132 0.0894 0.1060 0.1340 0.1331 0.1101
va: 2.1231 1.9938 2.0165 3.7077 3.8188 3.8229 3.8911 3.9087 3.8853 4.1213 3.7064 3.7281 3.9299 3.9364 3.9093 3.7335 3.4716 4.0209 3.9507 3.8235 3.8396 3.8962 1.0293 1.0287 1.0159 1.0011 0.9996 0.9994 1.0014 1.0030 1.0030 1.0182 1.0062 0.9962 0.9962 1.0000 1.0172 0.9982 1.0228 1.0226 0.9997 1.0020 0.9993 1.0216 0.9995 1.0017 1.0043 1.0205
dispcorr: -0.023261990 hartree
energy: -965.441430935992
dipole: -16.27326 15.63278 -0.64048 -9.64141 7.17044 -2.47097 -7.65911 7.42274 -0.23637
magnitude: 2.56355 au
magnitude: 6.51602 debye
