program: Orca
programVersion: 5.0.2
elementType: O O O C C C C C C C C C C C C C C C C C C C H H H H H H H H H H H H H H H H H H H H H H H H H H
charge: 0
multiplicity: 1
keywords: wb97x-d3
keywords: def2-TZVPP
keywords: def2/J RIJCOSX
keywords: DEFGRID2
keywords: scfconv7
keywords: smallprint printgap noloewdin
keywords: NOSOSCF
formula: C19H26O3
InChI: InChI=1/C19H26O3/c1-7-8-13-12(4)16(10-15(13)20)22-18(21)17-14(9-11(2)3)19(17,5)6/h7,9,14,16-17H,1,8,10H2,2-6H3
48 atoms
O  0.386153 -0.374873 0.540961
O  -0.975734 0.555611 2.046523
O  3.745201 2.670015 -0.009289
C  -2.924542 -1.64501 0.808188
C  -3.320007 -0.265959 0.408012
C  -1.881744 -0.702579 0.218992
C  -2.886784 -1.999851 2.273633
C  -3.305101 -2.806981 -0.076375
C  -4.177457 0.013568 -0.7733
C  -0.820023 -0.104481 1.0432
C  -4.109216 1.121937 -1.515259
C  1.531217 0.143704 1.227039
C  -5.037013 1.350384 -2.668515
C  -3.120057 2.218431 -1.268769
C  1.781218 1.622854 0.958459
C  2.727359 -0.568201 0.655949
C  3.64106 0.288556 0.174774
C  3.149958 1.662036 0.320197
C  2.792383 -2.048156 0.666826
C  4.938552 -0.038288 -0.478686
C  4.820121 -0.400651 -1.931711
C  3.696958 -0.525225 -2.628283
H  -3.454235 0.417804 1.242993
H  -1.577029 -0.945188 -0.792789
H  -3.850314 -2.416056 2.573597
H  -2.126534 -2.75681 2.474886
H  -2.690226 -1.144306 2.916556
H  -3.284007 -2.550683 -1.135399
H  -2.61974 -3.642519 0.075087
H  -4.310854 -3.158247 0.162706
H  -4.930234 -0.729271 -1.021721
H  1.444478 -0.072065 2.295364
H  -4.479494 1.489945 -3.598089
H  -5.73051 0.521867 -2.810201
H  -5.623589 2.260997 -2.52231
H  -2.464456 2.027216 -0.420881
H  -2.493325 2.375467 -2.150381
H  -3.634275 3.165692 -1.087314
H  1.766491 2.226593 1.866329
H  1.045442 2.049343 0.272917
H  2.483916 -2.443591 1.636135
H  3.791164 -2.416835 0.4407
H  2.108917 -2.466448 -0.075545
H  5.626325 0.806778 -0.384576
H  5.428325 -0.865923 0.043413
H  5.768217 -0.579086 -2.429494
H  3.723441 -0.79932 -3.674959
H  2.716907 -0.363038 -2.195375
elementType: O C H
totalener: -965.41825466 hartree
nucrepener: 1813.26051062 hartree
electener: -2778.67876528 hartree
oneelecener: -4912.74596492 hartree
twoeener: 2134.06719965 hartree
cpcmener: -0.03627473 hartree
kineticenergy: 961.00176457 hartree
xcener: -95.141633443860 hartree
chargesum: -0.0000000
charge: -0.299334 -0.503525 -0.483810 0.152825 -0.027522 -0.091066 -0.273617 -0.290000 -0.293974 0.400178 -0.015522 0.270471 -0.228493 -0.240927 -0.156517 -0.045698 -0.099246 0.335170 -0.268117 -0.066687 -0.189419 -0.279111 0.101453 0.094729 0.097735 0.100762 0.089993 0.093260 0.098720 0.100222 0.124898 0.111477 0.095186 0.089982 0.095628 0.077538 0.098357 0.101364 0.106682 0.106466 0.120747 0.104865 0.112721 0.089289 0.105755 0.133951 0.133122 0.109042
qa: -0.2993 -0.5035 -0.4838 0.1528 -0.0275 -0.0911 -0.2736 -0.2900 -0.2940 0.4002 -0.0155 0.2705 -0.2285 -0.2409 -0.1565 -0.0457 -0.0992 0.3352 -0.2681 -0.0667 -0.1894 -0.2791 0.1015 0.0947 0.0977 0.1008 0.0900 0.0933 0.0987 0.1002 0.1249 0.1115 0.0952 0.0900 0.0956 0.0775 0.0984 0.1014 0.1067 0.1065 0.1207 0.1049 0.1127 0.0893 0.1058 0.1340 0.1331 0.1090
va: 2.1213 1.9949 2.0164 3.7055 3.8253 3.8252 3.8897 3.9097 3.8845 4.1156 3.7058 3.7259 3.9294 3.9384 3.9088 3.7352 3.4777 4.0196 3.9517 3.8241 3.8411 3.8951 1.0277 1.0295 1.0011 0.9993 1.0169 1.0013 1.0028 0.9993 1.0029 1.0176 0.9964 1.0062 0.9960 1.0167 0.9985 0.9995 1.0221 1.0231 0.9997 1.0019 0.9995 1.0215 1.0000 1.0017 1.0043 1.0217
dispcorr: -0.023249373 hartree
energy: -965.441504034114
dipole: -16.48072 15.80731 -0.67341 -9.61226 7.10289 -2.50937 -7.89489 7.62712 -0.26777
magnitude: 2.61192 au
magnitude: 6.63897 debye
