program: Orca
programVersion: 5.0.2
elementType: O O O C C C C C C C C C C C C C C C C C C C H H H H H H H H H H H H H H H H H H H H H H H H H H
charge: 0
multiplicity: 1
keywords: wb97x-d3
keywords: def2-TZVPP
keywords: def2/J RIJCOSX
keywords: DEFGRID2
keywords: scfconv7
keywords: smallprint printgap noloewdin
keywords: NOSOSCF
formula: C19H26O3
InChI: InChI=1/C19H26O3/c1-7-8-13-12(4)16(10-15(13)20)22-18(21)17-14(9-11(2)3)19(17,5)6/h7,9,14,16-17H,1,8,10H2,2-6H3
48 atoms
O  -0.014909 1.534885 -0.625624
O  0.228252 -0.687132 -0.517233
O  4.431486 0.113987 -1.189767
C  -2.562414 -0.686878 -1.954135
C  -2.748454 -0.923318 -0.497717
C  -1.921458 0.268234 -0.954421
C  -1.714347 -1.64319 -2.755572
C  -3.699443 -0.098606 -2.754589
C  -4.041871 -0.697506 0.197214
C  -0.477534 0.282126 -0.685154
C  -4.161865 -0.329867 1.475789
C  1.371196 1.766103 -0.367007
C  -5.503878 -0.143901 2.114306
C  -2.990288 -0.066222 2.369992
C  2.332869 1.301166 -1.454686
C  1.878218 1.138501 0.907676
C  3.066193 0.540573 0.722228
C  3.420031 0.578862 -0.698325
C  1.11208 1.2771 2.168098
C  3.921994 -0.172203 1.718422
C  3.651617 -1.647733 1.665342
C  4.517478 -2.559548 1.240283
H  -2.144132 -1.732925 -0.09534
H  -2.403765 1.235924 -0.881392
H  -1.201156 -1.126334 -3.568506
H  -0.967464 -2.160769 -2.158632
H  -2.354736 -2.404616 -3.204875
H  -4.389307 -0.883105 -3.07149
H  -4.270283 0.642099 -2.195149
H  -3.319554 0.388079 -3.654295
H  -4.946571 -0.869438 -0.379169
H  1.417762 2.851172 -0.254863
H  -5.621656 -0.802436 2.978425
H  -5.619387 0.87682 2.487829
H  -6.320996 -0.345101 1.422022
H  -2.029037 -0.219768 1.882271
H  -3.016103 0.960208 2.744801
H  -3.024728 -0.713602 3.24982
H  2.753192 2.134624 -2.018906
H  1.872488 0.629268 -2.180634
H  1.714118 1.042396 3.043522
H  0.252409 0.603248 2.174713
H  0.718512 2.287626 2.277566
H  4.97656 0.022151 1.510731
H  3.718311 0.204494 2.723121
H  2.659198 -1.956843 1.98041
H  4.259262 -3.610145 1.206562
H  5.513112 -2.290755 0.906693
elementType: O C H
totalener: -965.41466111 hartree
nucrepener: 1848.75130781 hartree
electener: -2814.16596893 hartree
oneelecener: -4984.38217846 hartree
twoeener: 2170.21620953 hartree
cpcmener: -0.03982421 hartree
kineticenergy: 961.01618599 hartree
xcener: -95.146103463698 hartree
chargesum: -0.0000000
charge: -0.301052 -0.501622 -0.490202 0.156926 -0.022400 -0.116980 -0.281889 -0.290009 -0.300204 0.410220 -0.014257 0.296188 -0.232301 -0.224136 -0.153333 -0.000489 -0.130735 0.298637 -0.272255 -0.100214 -0.180179 -0.286041 0.104823 0.089853 0.100431 0.092292 0.096913 0.099890 0.093295 0.098047 0.125371 0.119686 0.096264 0.096024 0.090726 0.064294 0.100199 0.102832 0.113530 0.113747 0.110825 0.117831 0.117837 0.093681 0.110488 0.142268 0.131489 0.113695
qa: -0.3011 -0.5016 -0.4902 0.1569 -0.0224 -0.1170 -0.2819 -0.2900 -0.3002 0.4102 -0.0143 0.2962 -0.2323 -0.2241 -0.1533 -0.0005 -0.1307 0.2986 -0.2723 -0.1002 -0.1802 -0.2860 0.1048 0.0899 0.1004 0.0923 0.0969 0.0999 0.0933 0.0980 0.1254 0.1197 0.0963 0.0960 0.0907 0.0643 0.1002 0.1028 0.1135 0.1137 0.1108 0.1178 0.1178 0.0937 0.1105 0.1423 0.1315 0.1137
va: 2.1294 2.0001 2.0021 3.6944 3.8126 3.8300 3.8901 3.9117 3.8873 4.1267 3.7146 3.7649 3.9290 3.9312 3.8767 3.6778 3.4699 4.0574 3.9446 3.8661 3.7743 3.9465 1.0252 1.0354 0.9991 1.0191 1.0009 0.9991 1.0017 1.0028 1.0030 0.9903 0.9959 0.9962 1.0058 1.0160 0.9980 1.0004 1.0212 1.0255 1.0044 0.9932 0.9999 1.0199 1.0093 1.0021 1.0029 1.0132
dispcorr: -0.024408371 hartree
energy: -965.439069482910
dipole: -20.17454 17.56101 -2.61353 -3.95357 5.71311 1.75953 6.52877 -5.32634 1.20244
magnitude: 3.37229 au
magnitude: 8.57169 debye
