program: Orca
programVersion: 5.0.2
elementType: O O O C C C C C C C C C C C C C C C C C C C H H H H H H H H H H H H H H H H H H H H H H H H H H
charge: 0
multiplicity: 1
keywords: wb97x-d3
keywords: def2-TZVPP
keywords: def2/J RIJCOSX
keywords: DEFGRID2
keywords: scfconv7
keywords: smallprint printgap noloewdin
keywords: NOSOSCF
formula: C19H26O3
InChI: InChI=1/C19H26O3/c1-7-8-13-12(4)16(10-15(13)20)22-18(21)17-14(9-11(2)3)19(17,5)6/h7,9,14,16-17H,1,8,10H2,2-6H3
48 atoms
O  -0.005927 1.520108 -0.645518
O  0.209769 -0.704643 -0.525286
O  4.417758 0.023113 -1.17818
C  -2.595148 -0.630667 -1.968745
C  -2.768038 -0.916027 -0.519196
C  -1.932698 0.280169 -0.942165
C  -1.766985 -1.569015 -2.810644
C  -3.732917 0.000781 -2.734375
C  -4.05177 -0.702521 0.196988
C  -0.484867 0.272905 -0.691071
C  -4.153891 -0.37541 1.487933
C  1.382866 1.739703 -0.392529
C  -5.48689 -0.202866 2.148652
C  -2.969021 -0.146117 2.374368
C  2.341443 1.242924 -1.469378
C  1.882613 1.135189 0.896323
C  3.065605 0.522955 0.725782
C  3.417596 0.520751 -0.696458
C  1.116984 1.314471 2.152017
C  3.924737 -0.161659 1.739589
C  3.680779 -1.642632 1.711859
C  4.564074 -2.546086 1.305503
H  -2.16947 -1.747454 -0.153897
H  -2.401493 1.251179 -0.832066
H  -2.419115 -2.314126 -3.270093
H  -1.263088 -1.032952 -3.61705
H  -1.01395 -2.107627 -2.240098
H  -3.356359 0.516918 -3.618977
H  -4.436363 -0.762191 -3.073407
H  -4.287816 0.726704 -2.140439
H  -4.963927 -0.850881 -0.374233
H  1.44136 2.826377 -0.302867
H  -5.600998 -0.894486 2.987061
H  -5.589386 0.803082 2.563611
H  -6.313102 -0.369671 1.458019
H  -2.015853 -0.319932 1.877419
H  -2.966939 0.878613 2.755228
H  -3.012665 -0.797929 3.250485
H  2.777118 2.062295 -2.042841
H  1.874871 0.567426 -2.187777
H  1.703466 1.055902 3.031471
H  0.224119 0.683257 2.157252
H  0.772279 2.344864 2.253511
H  4.977196 0.047404 1.534732
H  3.708965 0.229026 2.736392
H  2.692546 -1.962443 2.029323
H  4.327601 -3.602374 1.296997
H  5.558863 -2.266434 0.978429
elementType: O C H
totalener: -965.41483238 hartree
nucrepener: 1846.95359820 hartree
electener: -2812.36843058 hartree
oneelecener: -4980.80136016 hartree
twoeener: 2168.43292958 hartree
cpcmener: -0.04005047 hartree
kineticenergy: 961.00748005 hartree
xcener: -95.144231513372 hartree
chargesum: 0.0000000
charge: -0.299998 -0.501457 -0.489502 0.155884 -0.021745 -0.112721 -0.280559 -0.289723 -0.302661 0.405911 -0.010172 0.292720 -0.232282 -0.233672 -0.151071 -0.003959 -0.127300 0.297371 -0.265512 -0.103150 -0.178315 -0.287535 0.104219 0.090227 0.097365 0.100420 0.091671 0.098287 0.099986 0.093147 0.125173 0.119496 0.096555 0.095875 0.090674 0.070224 0.101440 0.102364 0.113827 0.113795 0.108520 0.115261 0.117120 0.095547 0.110343 0.142613 0.131463 0.113838
qa: -0.3000 -0.5015 -0.4895 0.1559 -0.0217 -0.1127 -0.2806 -0.2897 -0.3027 0.4059 -0.0102 0.2927 -0.2323 -0.2337 -0.1511 -0.0040 -0.1273 0.2974 -0.2655 -0.1031 -0.1783 -0.2875 0.1042 0.0902 0.0974 0.1004 0.0917 0.0983 0.1000 0.0931 0.1252 0.1195 0.0966 0.0959 0.0907 0.0702 0.1014 0.1024 0.1138 0.1138 0.1085 0.1153 0.1171 0.0955 0.1103 0.1426 0.1315 0.1138
va: 2.1296 1.9997 2.0028 3.6970 3.8120 3.8223 3.8908 3.9102 3.8899 4.1323 3.7051 3.7697 3.9294 3.9326 3.8744 3.6807 3.4655 4.0585 3.9468 3.8676 3.7727 3.9483 1.0255 1.0353 1.0009 0.9992 1.0185 1.0028 0.9992 1.0017 1.0031 0.9905 0.9959 0.9961 1.0059 1.0146 0.9973 1.0005 1.0210 1.0259 1.0050 0.9953 0.9995 1.0185 1.0091 1.0017 1.0030 1.0130
dispcorr: -0.024351526 hartree
energy: -965.439183903840
dipole: -20.11098 17.54158 -2.56940 -3.57742 5.41917 1.84176 6.60684 -5.42024 1.18660
magnitude: 3.37667 au
magnitude: 8.58282 debye
