program: Orca
programVersion: 5.0.2
elementType: O O O C C C C C C C C C C C C C C C C C C C H H H H H H H H H H H H H H H H H H H H H H H H H H
charge: 0
multiplicity: 1
keywords: wb97x-d3
keywords: def2-TZVPP
keywords: def2/J RIJCOSX
keywords: DEFGRID2
keywords: scfconv7
keywords: smallprint printgap noloewdin
keywords: NOSOSCF
formula: C19H26O3
InChI: InChI=1/C19H26O3/c1-7-8-13-12(4)16(10-15(13)20)22-18(21)17-14(9-11(2)3)19(17,5)6/h7,9,14,16-17H,1,8,10H2,2-6H3
48 atoms
O  0.214912 1.294186 -0.847195
O  -0.071037 -0.881697 -0.407405
O  4.371585 -0.964608 -1.234352
C  -2.86048 -0.355651 -1.786211
C  -3.027419 -0.375012 -0.299365
C  -1.955438 0.507707 -0.922934
C  -2.325733 -1.594138 -2.461988
C  -3.84418 0.397717 -2.649373
C  -4.154742 0.269425 0.399244
C  -0.534844 0.19792 -0.696682
C  -4.737206 -0.149527 1.528199
C  1.626255 1.23181 -0.638636
C  -5.863286 0.628955 2.140003
C  -4.348533 -1.377662 2.294283
C  2.423185 0.420871 -1.654773
C  2.042006 0.697406 0.709643
C  3.09277 -0.132532 0.603086
C  3.430438 -0.320195 -0.809679
C  1.383483 1.183661 1.94465
C  3.908985 -0.756232 1.689726
C  5.134762 0.067554 1.958054
C  6.376795 -0.314106 1.687731
H  -2.632977 -1.268437 0.172335
H  -2.180004 1.567626 -0.960078
H  -1.709815 -2.209522 -1.810614
H  -3.161326 -2.211928 -2.796376
H  -1.736677 -1.33665 -3.344289
H  -4.735354 -0.206222 -2.829952
H  -4.163397 1.341719 -2.21029
H  -3.396754 0.623681 -3.618835
H  -4.528398 1.187754 -0.04396
H  1.921269 2.282325 -0.687036
H  -6.769538 0.021451 2.206126
H  -5.619668 0.929162 3.162567
H  -6.100918 1.528672 1.572642
H  -3.633585 -2.013522 1.778496
H  -3.913417 -1.105825 3.258441
H  -5.229085 -1.983314 2.516495
H  2.92409 1.048023 -2.392688
H  1.809836 -0.294786 -2.205336
H  0.326272 0.91102 1.967769
H  1.424007 2.274272 1.988001
H  1.849701 0.788455 2.844387
H  3.31401 -0.840172 2.60162
H  4.195242 -1.770109 1.401924
H  4.956246 1.051044 2.383263
H  7.222524 0.328541 1.896101
H  6.595767 -1.285367 1.259274
elementType: O C H
totalener: -965.41626429 hartree
nucrepener: 1802.14707458 hartree
electener: -2767.56333887 hartree
oneelecener: -4891.04524282 hartree
twoeener: 2123.48190395 hartree
cpcmener: -0.04000931 hartree
kineticenergy: 960.99718237 hartree
xcener: -95.143537485586 hartree
chargesum: 0.0000000
charge: -0.302306 -0.496819 -0.492220 0.100862 0.030693 -0.097082 -0.274480 -0.276495 -0.282801 0.411045 -0.048156 0.282283 -0.217591 -0.257192 -0.150112 0.008959 -0.127279 0.307395 -0.250963 -0.115937 -0.174928 -0.290040 0.095424 0.088899 0.090270 0.098283 0.099192 0.098532 0.090514 0.097694 0.120492 0.120330 0.094228 0.092823 0.088291 0.092461 0.100345 0.093968 0.108265 0.114378 0.114689 0.115351 0.101424 0.109603 0.097535 0.144320 0.131515 0.114339
qa: -0.3023 -0.4968 -0.4922 0.1009 0.0307 -0.0971 -0.2745 -0.2765 -0.2828 0.4110 -0.0482 0.2823 -0.2176 -0.2572 -0.1501 0.0090 -0.1273 0.3074 -0.2510 -0.1159 -0.1749 -0.2900 0.0954 0.0889 0.0903 0.0983 0.0992 0.0985 0.0905 0.0977 0.1205 0.1203 0.0942 0.0928 0.0883 0.0925 0.1003 0.0940 0.1083 0.1144 0.1147 0.1154 0.1014 0.1096 0.0975 0.1443 0.1315 0.1143
va: 2.1296 2.0136 1.9995 3.7049 3.7771 3.8256 3.9040 3.9101 3.8870 4.1574 3.7610 3.7791 3.9195 3.9394 3.8952 3.6548 3.4831 4.0486 3.9490 3.8754 3.7812 3.9514 1.0290 1.0386 1.0193 0.9998 0.9996 1.0010 1.0068 1.0012 1.0113 0.9916 0.9963 0.9957 1.0089 1.0097 0.9958 0.9978 1.0244 1.0249 1.0017 0.9969 1.0039 1.0064 1.0195 0.9996 1.0029 1.0128
dispcorr: -0.022504258 hartree
energy: -965.438768548773
dipole: -21.34293 18.97476 -2.36817 -0.06574 2.08204 2.01629 7.18333 -6.28329 0.90005
magnitude: 3.23786 au
magnitude: 8.22999 debye
