program: Orca
programVersion: 5.0.2
elementType: O O O C C C C C C C C C C C C C C C C C C C H H H H H H H H H H H H H H H H H H H H H H H H H H
charge: 0
multiplicity: 1
keywords: wb97x-d3
keywords: def2-TZVPP
keywords: def2/J RIJCOSX
keywords: DEFGRID2
keywords: scfconv7
keywords: smallprint printgap noloewdin
keywords: NOSOSCF
formula: C19H26O3
InChI: InChI=1/C19H26O3/c1-7-8-13-12(4)16(10-15(13)20)22-18(21)17-14(9-11(2)3)19(17,5)6/h7,9,14,16-17H,1,8,10H2,2-6H3
48 atoms
O  0.355501 -0.464395 0.571299
O  -0.954769 0.437994 2.137793
O  3.576492 2.732091 -0.089983
C  -3.042936 -1.622058 0.929541
C  -3.330501 -0.230151 0.488152
C  -1.927245 -0.780888 0.320866
C  -3.042333 -1.943837 2.403147
C  -3.511495 -2.771175 0.070532
C  -4.153805 0.080818 -0.709291
C  -0.834233 -0.209293 1.121027
C  -3.906572 1.079094 -1.560937
C  1.508366 0.110853 1.196111
C  -4.797805 1.345122 -2.734725
C  -2.731785 1.999382 -1.432946
C  1.67526 1.596994 0.901569
C  2.715602 -0.549037 0.588025
C  3.58273 0.347945 0.093081
C  3.031818 1.697848 0.245586
C  2.849218 -2.024133 0.603858
C  4.888912 0.082631 -0.571758
C  4.780967 -0.286124 -2.023593
C  3.662366 -0.482251 -2.710454
H  -3.415883 0.485868 1.302604
H  -1.641131 -1.069053 -0.684209
H  -4.034664 -2.287039 2.700878
H  -2.33822 -2.746192 2.629406
H  -2.794051 -1.089553 3.029111
H  -3.464601 -2.543347 -0.994069
H  -2.899146 -3.656861 0.247504
H  -4.543956 -3.031515 0.3112
H  -5.030495 -0.53905 -0.876283
H  1.481743 -0.093486 2.270069
H  -4.235388 1.298226 -3.670675
H  -5.620491 0.633375 -2.797937
H  -5.223275 2.35036 -2.681666
H  -3.050001 3.041417 -1.509168
H  -2.190922 1.885316 -0.49556
H  -2.024008 1.834151 -2.249478
H  1.634037 2.217746 1.796777
H  0.910956 1.966179 0.213585
H  2.627905 -2.420819 1.595841
H  3.844943 -2.350472 0.312776
H  2.134934 -2.482279 -0.082857
H  5.534607 0.960492 -0.482258
H  5.42217 -0.718785 -0.051781
H  5.734131 -0.405246 -2.529161
H  3.697167 -0.751844 -3.758046
H  2.678161 -0.378394 -2.269764
elementType: O C H
totalener: -965.41818883 hartree
nucrepener: 1818.54458453 hartree
electener: -2783.96277336 hartree
oneelecener: -4923.30210649 hartree
twoeener: 2139.33933313 hartree
cpcmener: -0.03601591 hartree
kineticenergy: 961.00861418 hartree
xcener: -95.143416078257 hartree
chargesum: -0.0000000
charge: -0.302384 -0.502661 -0.483844 0.144914 -0.011207 -0.088431 -0.276023 -0.285092 -0.308504 0.390388 -0.009451 0.274644 -0.229246 -0.240854 -0.154602 -0.054444 -0.091174 0.332940 -0.264584 -0.067216 -0.189096 -0.280255 0.102089 0.095318 0.096656 0.100650 0.089943 0.093669 0.098089 0.099228 0.124887 0.110587 0.094998 0.089731 0.096900 0.101731 0.078183 0.103015 0.106389 0.105818 0.121472 0.102565 0.112679 0.089434 0.105328 0.133753 0.133181 0.109889
qa: -0.3024 -0.5027 -0.4838 0.1449 -0.0112 -0.0884 -0.2760 -0.2851 -0.3085 0.3904 -0.0095 0.2746 -0.2292 -0.2409 -0.1546 -0.0544 -0.0912 0.3329 -0.2646 -0.0672 -0.1891 -0.2803 0.1021 0.0953 0.0967 0.1007 0.0899 0.0937 0.0981 0.0992 0.1249 0.1106 0.0950 0.0897 0.0969 0.1017 0.0782 0.1030 0.1064 0.1058 0.1215 0.1026 0.1127 0.0894 0.1053 0.1338 0.1332 0.1099
va: 2.1191 1.9957 2.0168 3.7034 3.8071 3.8239 3.8935 3.9083 3.8935 4.1231 3.7038 3.7218 3.9316 3.9380 3.9047 3.7415 3.4685 4.0242 3.9512 3.8247 3.8396 3.8965 1.0279 1.0287 1.0011 0.9991 1.0175 1.0017 1.0030 1.0000 1.0034 1.0179 0.9961 1.0060 0.9961 1.0005 1.0137 0.9975 1.0231 1.0233 0.9991 1.0026 1.0003 1.0214 0.9996 1.0017 1.0042 1.0206
dispcorr: -0.023473980 hartree
energy: -965.441662810344
dipole: -15.69521 15.09936 -0.59585 -9.44868 6.97050 -2.47818 -8.12033 7.79327 -0.32706
magnitude: 2.56970 au
magnitude: 6.53166 debye
