program: Orca
programVersion: 5.0.2
elementType: O O O C C C C C C C C C C C C C C C C C C C H H H H H H H H H H H H H H H H H H H H H H H H H H
charge: 0
multiplicity: 1
keywords: wb97x-d3
keywords: def2-TZVPP
keywords: def2/J RIJCOSX
keywords: DEFGRID2
keywords: scfconv7
keywords: smallprint printgap noloewdin
keywords: NOSOSCF
formula: C19H26O3
InChI: InChI=1/C19H26O3/c1-7-8-13-12(4)16(10-15(13)20)22-18(21)17-14(9-11(2)3)19(17,5)6/h7,9,14,16-17H,1,8,10H2,2-6H3
48 atoms
O  0.278603 1.518588 0.046605
O  -0.047498 -0.613135 -0.555894
O  4.254947 -0.342357 -1.712171
C  -2.817548 0.608804 -1.48015
C  -2.997376 -0.184192 -0.221376
C  -1.911794 0.868314 -0.286395
C  -2.290282 -0.09652 -2.704543
C  -3.795909 1.709519 -1.808958
C  -4.136396 0.031604 0.697391
C  -0.492087 0.480444 -0.29078
C  -5.049161 -0.879538 1.049177
C  1.697789 1.369823 0.094532
C  -6.151464 -0.53301 2.004137
C  -5.08137 -2.289177 0.543081
C  2.387181 1.132796 -1.244478
C  2.187872 0.263876 0.995952
C  3.184235 -0.42951 0.42109
C  3.398901 0.055336 -0.944061
C  1.649909 0.122718 2.369377
C  4.050342 -1.492963 1.016189
C  5.32053 -0.887299 1.538557
C  6.522166 -1.069992 1.0050
H  -2.635048 -1.204747 -0.290035
H  -2.117015 1.795533 0.237713
H  -1.682002 -0.96796 -2.471924
H  -3.128913 -0.441008 -3.312432
H  -1.694833 0.578771 -3.321934
H  -4.685076 1.296756 -2.289393
H  -4.12004 2.263605 -0.92911
H  -3.348572 2.423593 -2.502461
H  -4.227773 1.028851 1.118946
H  2.024724 2.320135 0.521885
H  -6.080554 0.494273 2.361203
H  -7.131036 -0.661532 1.536135
H  -6.137317 -1.19493 2.874048
H  -6.032018 -2.48924 0.041926
H  -4.284954 -2.522762 -0.161076
H  -5.016883 -3.000406 1.370581
H  2.880732 2.027837 -1.623978
H  1.704311 0.791049 -2.024333
H  1.775436 1.058451 2.919453
H  2.144222 -0.669674 2.92728
H  0.578828 -0.090462 2.359613
H  3.520043 -1.997359 1.826864
H  4.278199 -2.250542 0.263321
H  5.210503 -0.233343 2.399153
H  7.400069 -0.58608 1.413726
H  6.672317 -1.703142 0.137962
elementType: O C H
totalener: -965.41612759 hartree
nucrepener: 1798.12931987 hartree
electener: -2763.54544746 hartree
oneelecener: -4883.05540353 hartree
twoeener: 2119.50995607 hartree
cpcmener: -0.03997312 hartree
kineticenergy: 961.00040766 hartree
xcener: -95.143255122557 hartree
chargesum: -0.0000000
charge: -0.300158 -0.495447 -0.491973 0.131611 0.032455 -0.146898 -0.286018 -0.265982 -0.290118 0.423093 -0.038349 0.282556 -0.223767 -0.253722 -0.149162 0.008212 -0.128901 0.308068 -0.253063 -0.114486 -0.173282 -0.290222 0.093855 0.089751 0.091542 0.098378 0.100473 0.097224 0.089339 0.098848 0.123646 0.120278 0.089743 0.094048 0.093967 0.096293 0.090722 0.097053 0.109234 0.113629 0.115098 0.101959 0.116247 0.109576 0.096216 0.143686 0.131496 0.113251
qa: -0.3002 -0.4954 -0.4920 0.1316 0.0325 -0.1469 -0.2860 -0.2660 -0.2901 0.4231 -0.0383 0.2826 -0.2238 -0.2537 -0.1492 0.0082 -0.1289 0.3081 -0.2531 -0.1145 -0.1733 -0.2902 0.0939 0.0898 0.0915 0.0984 0.1005 0.0972 0.0893 0.0988 0.1236 0.1203 0.0897 0.0940 0.0940 0.0963 0.0907 0.0971 0.1092 0.1136 0.1151 0.1020 0.1162 0.1096 0.0962 0.1437 0.1315 0.1133
va: 2.1319 2.0158 2.0001 3.6774 3.7663 3.8958 3.9068 3.9048 3.8700 4.1472 3.7344 3.7783 3.9223 3.9444 3.8929 3.6549 3.4867 4.0486 3.9478 3.8743 3.7819 3.9497 1.0301 1.0418 1.0183 1.0005 0.9993 1.0025 1.0044 1.0022 1.0081 0.9913 1.0082 0.9964 0.9959 0.9972 1.0086 0.9971 1.0238 1.0243 0.9965 1.0037 1.0015 1.0067 1.0207 0.9997 1.0028 1.0138
dispcorr: -0.022699925 hartree
energy: -965.438827518796
dipole: -22.21116 19.95847 -2.25269 -2.90720 4.34462 1.43741 4.77827 -3.03064 1.74762
magnitude: 3.19295 au
magnitude: 8.11584 debye
