program: Orca
programVersion: 5.0.2
elementType: O O O C C C C C C C C C C C C C C C C C C C H H H H H H H H H H H H H H H H H H H H H H H H H H
charge: 0
multiplicity: 1
keywords: wb97x-d3
keywords: def2-TZVPP
keywords: def2/J RIJCOSX
keywords: DEFGRID2
keywords: scfconv7
keywords: smallprint printgap noloewdin
keywords: NOSOSCF
formula: C19H26O3
InChI: InChI=1/C19H26O3/c1-7-8-13-12(4)16(10-15(13)20)22-18(21)17-14(9-11(2)3)19(17,5)6/h7,9,14,16-17H,1,8,10H2,2-6H3
48 atoms
O  -0.047904 0.0052 0.835011
O  -0.530299 0.317301 2.991042
O  4.04158 2.07695 0.277309
C  -2.797403 1.566773 0.632177
C  -2.74489 0.21806 -0.027033
C  -2.296914 0.363852 1.411763
C  -1.821009 2.621746 0.171485
C  -4.120276 2.141867 1.073462
C  -3.941447 -0.587324 -0.335074
C  -0.889339 0.232353 1.837283
C  -4.073649 -1.384998 -1.399569
C  1.346501 -0.109728 1.125753
C  -5.311616 -2.203378 -1.602216
C  -3.004162 -1.559502 -2.444337
C  2.040151 1.22705 1.356948
C  2.000628 -0.68889 -0.099981
C  3.032566 0.060997 -0.516602
C  3.166984 1.235362 0.350964
C  1.514813 -1.967962 -0.66861
C  3.98283 -0.23298 -1.634428
C  5.096735 -1.119938 -1.160556
C  5.320355 -2.347294 -1.613876
H  -1.935885 0.115018 -0.740706
H  -2.983569 0.010834 2.174149
H  -1.548872 3.28685 0.993646
H  -0.904719 2.207255 -0.245109
H  -2.279904 3.234524 -0.606371
H  -4.632128 2.612317 0.231796
H  -4.789297 1.392609 1.494099
H  -3.967047 2.90772 1.835829
H  -4.759265 -0.544011 0.377963
H  1.486696 -0.791293 1.969514
H  -6.031608 -2.07028 -0.795028
H  -5.804123 -1.945711 -2.543332
H  -5.068796 -3.26763 -1.665806
H  -2.5073 -0.624867 -2.703859
H  -2.228651 -2.252514 -2.107616
H  -3.419959 -1.97277 -3.363394
H  2.421383 1.345971 2.370924
H  1.373667 2.069807 1.15574
H  0.492972 -1.865339 -1.041052
H  1.488775 -2.739402 0.104035
H  2.137312 -2.323482 -1.486694
H  3.45748 -0.706444 -2.465395
H  4.395006 0.706335 -2.012313
H  5.733927 -0.710965 -0.382032
H  6.130582 -2.952609 -1.228019
H  4.704201 -2.791617 -2.387212
elementType: O C H
totalener: -965.41600553 hartree
nucrepener: 1815.01811125 hartree
electener: -2780.43411678 hartree
oneelecener: -4915.59917719 hartree
twoeener: 2135.16506041 hartree
cpcmener: -0.03780971 hartree
kineticenergy: 961.00456226 hartree
xcener: -95.141308775428 hartree
chargesum: 0.0000000
charge: -0.282735 -0.494690 -0.487186 0.092852 0.076404 -0.107450 -0.273462 -0.285689 -0.315050 0.420443 -0.012896 0.214162 -0.224426 -0.293343 -0.143521 -0.058469 -0.060323 0.336458 -0.243719 -0.104253 -0.178913 -0.290978 0.091605 0.097014 0.101618 0.084780 0.100308 0.097634 0.090745 0.097526 0.121002 0.113109 0.086117 0.094440 0.097985 0.101311 0.107145 0.099580 0.107657 0.110933 0.108337 0.116058 0.095506 0.104190 0.097877 0.144876 0.132841 0.116591
qa: -0.2827 -0.4947 -0.4872 0.0929 0.0764 -0.1074 -0.2735 -0.2857 -0.3151 0.4204 -0.0129 0.2142 -0.2244 -0.2933 -0.1435 -0.0585 -0.0603 0.3365 -0.2437 -0.1043 -0.1789 -0.2910 0.0916 0.0970 0.1016 0.0848 0.1003 0.0976 0.0907 0.0975 0.1210 0.1131 0.0861 0.0944 0.0980 0.1013 0.1071 0.0996 0.1077 0.1109 0.1083 0.1161 0.0955 0.1042 0.0979 0.1449 0.1328 0.1166
va: 2.1180 2.0028 2.0076 3.7141 3.7227 3.8539 3.9012 3.9098 3.8921 4.1535 3.6986 3.7612 3.9251 3.9424 3.9163 3.7812 3.4443 4.0300 3.9582 3.8640 3.7844 3.9458 1.0205 1.0291 0.9995 1.0147 1.0015 1.0008 1.0063 1.0013 1.0104 1.0167 1.0097 0.9941 0.9931 0.9985 0.9935 1.0023 1.0238 1.0179 1.0034 0.9973 1.0076 1.0048 1.0227 1.0046 1.0030 1.0084
dispcorr: -0.023436653 hartree
energy: -965.439442182218
dipole: -17.34143 15.62526 -1.71616 -7.17804 5.55744 -1.62060 -13.00021 11.52076 -1.47945
magnitude: 2.78574 au
magnitude: 7.08079 debye
