program: Gaussian 09
title: 000060750
version: EM64L-G09RevD.01
frameworkgroup: C1[X(C9H11F2N3O4)]
method: RPBEPBE
basis: SDD
operation: Freq
keyword: #p
keyword: freq=noraman
keyword: PBEPBE/SDD
title: #p freq=noraman PBEPBE/SDD
converged: YES YES NO NO
title: Mulliken charges:
elementType: F F O O O O N N N C C C C C C C C C H H H H H H H H H H H
charge: -0.162960 -0.183611 -0.292023 -0.422438 -0.427580 -0.249536 -0.231989 -0.049047 -0.617428 -0.184949 0.269548 -0.046949 -0.092585 -0.344638 -0.024134 0.078320 -0.359493 0.193288 0.264750 0.251130 0.317449 0.187363 0.240119 0.365345 0.262155 0.356397 0.234606 0.323046 0.345845
chargesum: 0.00000
title: Mulliken charges with hydrogens summed into heavy atoms:
elementType: F F O O O O N N N C C C C C C C C C
charge: -0.162960 -0.183611 -0.292023 -0.057093 -0.071182 -0.249536 -0.231989 -0.049047 0.051463 0.079801 0.269548 0.204181 0.224864 0.082844 0.238021 0.078320 -0.124887 0.193288
polarizability: 1.88804512e+02 -8.47330130e+00 9.71309331e+01 1.15714760e+01 -1.55495394e+01 1.20088708e+02
1716.lowfreq: -8.9263 -0.0009 -0.0007 -0.0004 1.7673 5.2191 24.6687 35.7748 41.5297
frequency: 24.6498 35.7415 41.5060 68.5978 93.9455 123.3013 163.6676 186.9505 200.6615 231.2731 237.1491 257.2752 279.5298 310.6255 322.4012 340.0823 349.6600 377.8267 412.1091 427.7323 454.8578 464.2705 516.1558 529.0124 561.6934 570.2737 580.8274 587.0347 595.4265 667.2392 696.5558 726.3352 741.8956 769.4078 781.7157 814.2777 857.8339 905.7560 930.9555 941.9840 970.1192 985.9957 1003.2785 1009.9847 1032.0790 1042.5169 1076.2156 1102.2512 1124.8608 1137.4942 1188.0957 1192.4293 1210.6002 1224.4961 1253.1894 1265.6418 1294.9370 1313.6291 1328.6593 1343.3126 1349.9823 1371.2667 1385.9390 1394.4273 1456.9248 1487.7833 1506.7831 1603.3302 1639.8523 1661.5640 2955.9668 2988.5545 3006.4875 3055.7839 3089.3203 3168.2548 3192.7404 3537.6769 3543.3019 3555.3588 3695.4999
redmass: 7.8204 6.9243 6.3800 7.3522 4.7740 5.4893 3.8308 4.8306 7.6945 8.1548 9.7476 3.6485 7.6882 7.7951 1.8001 2.6136 3.3685 4.5119 2.4948 1.3341 1.2279 3.4455 6.1473 5.6541 8.3506 4.7596 7.0302 1.3838 3.9194 6.3923 2.8712 6.3563 6.0062 2.0372 4.5650 3.8205 3.6764 4.2309 1.5969 4.8247 4.9773 4.7930 3.3061 2.8557 2.8903 3.0057 2.3559 2.8536 4.2749 2.5855 1.5279 1.6961 1.3931 2.2154 1.5526 1.6022 1.6236 1.3072 1.2926 1.4736 1.5232 1.2505 1.3887 1.6286 1.0824 4.3989 4.6679 1.7690 2.8781 8.6063 1.0697 1.0840 1.0838 1.0854 1.0943 1.0889 1.1008 1.0456 1.0657 1.0660 1.1044
irintensity: 2.0293 4.7242 0.9204 7.5533 1.0895 1.5686 2.5768 9.7076 3.0665 0.0058 8.2931 18.9140 8.7329 2.8511 67.9991 74.2527 3.7158 3.4217 30.8754 106.0400 75.0604 104.8114 7.3195 6.3018 3.1500 4.0636 22.2795 124.7440 33.6769 6.1769 1.1601 21.2318 2.8982 99.3123 21.4552 19.6675 69.4233 48.7098 20.8302 184.5764 155.6603 73.8852 25.4900 64.8006 11.8064 23.5000 13.9766 19.3376 103.5583 27.1822 37.8830 36.4383 16.8755 4.2609 80.2140 80.5889 20.7834 6.6727 8.9754 31.8615 19.3733 75.6724 79.6113 58.3307 6.7346 164.0592 61.6856 126.9003 389.5278 676.3911 38.7168 37.9009 24.5124 15.7729 14.0377 0.4421 5.0543 128.8864 28.2423 11.9278 42.3373
temp: 298.150 k
press: 1.00000 atm
elementType: 9 9 8 8 8 8 7 7 7 6 6 6 6 6 6 6 6 6 1 1 1 1 1 1 1 1 1 1 1
symmnumber: 1
zpe: 549832.3 jmol-1
zpe.correction: 0.209420 hartree
zpe.thermalcorrener: 0.226429 hartree
zpe.thermalcorrenthalpy: 0.227373 hartree
zpe.thermalcorrgfe: 0.163615 hartree
zpe.sumelectzpe: -1013.014869 hartree
zpe.sumelectthermal: -1012.997861 hartree
zpe.sumelectthermalent: -1012.996917 hartree
zpe.sumelectthermalfe: -1013.060675 hartree
dipole: -2.3482 2.3540 -5.4834
dipole: 6.4127
quadrupole: -88.5359 -113.0624 -108.7458
quadrupole: -15.1061 19.3299 -6.1445
quadrupole: 14.9122 -9.6144 -5.2978 -15.1061 19.3299 -6.1445
hfenergy: -1013.2242895 hartree
pointgroup: C01 [X(C9H11F2N3O4)]
dipole: -0.9270038 1.6178618 -1.6995356 debye
polarizability: 188.7572152|-12.6743714|110.0585963|7.1034572|-19.2330551|107.2083416 unknown
InChI: InChI=1S/C9H11F2N3O4/c10-9(11)6(16)4(3-15)18-7(9)14-2-1-5(12)13-8(14)17/h1-2,4,6-7,15-16H,3,12H2
charge 0 multiplicity 1
29 atoms
F  0.40651 -1.175632 -1.907841
F  1.489681 -2.361808 -0.282362
O  1.180405 0.942256 0.659337
O  3.636465 -1.054861 -1.260058
O  3.421014 2.601357 1.528939
O  -1.672599 -1.331321 1.919865
N  -0.987873 0.066272 0.147364
N  -3.339506 -0.172735 0.735931
N  -4.955614 0.991925 -0.444905
C  2.487179 -0.240361 -0.945587
C  1.166459 -1.023688 -0.714824
C  2.602391 0.586789 0.36106
C  0.385095 -0.289135 0.427696
C  3.375822 1.895743 0.250124
C  -1.307549 0.982093 -0.838048
C  -2.037614 -0.537367 1.012394
C  -2.616233 1.334451 -1.078263
C  -3.62735 0.703518 -0.250174
H  2.34879 0.43638 -1.807261
H  3.008779 -0.033285 1.187428
H  0.360514 -0.93837 1.325458
H  2.919629 2.523455 -0.546124
H  4.425562 1.686167 -0.013248
H  3.596644 -1.901268 -0.74301
H  -0.474138 1.41929 -1.392929
H  2.489168 2.740423 1.83883
H  -2.86585 2.059464 -1.854865
H  -5.268639 1.635367 -1.166687
H  -5.63484 0.529979 0.158858
