program: Orca
programVersion: 5.0.2
elementType: O O O C C C C C C C C C C C C C C C C C C C H H H H H H H H H H H H H H H H H H H H H H H H H H
charge: 0
multiplicity: 1
keywords: wb97x-d3
keywords: def2-TZVPP
keywords: def2/J RIJCOSX
keywords: DEFGRID2
keywords: scfconv7
keywords: smallprint printgap noloewdin
keywords: NOSOSCF
formula: C19H26O3
InChI: InChI=1/C19H26O3/c1-7-8-13-12(4)16(10-15(13)20)22-18(21)17-14(9-11(2)3)19(17,5)6/h7,9,14,16-17H,1,8,10H2,2-6H3
48 atoms
O  0.102437 0.877391 0.601535
O  -0.631559 2.949121 0.98238
O  4.209772 1.484333 -1.310276
C  -2.43117 0.927905 -1.260034
C  -2.502825 -0.092803 -0.15995
C  -2.168152 1.34213 0.178524
C  -1.29123 0.838689 -2.245129
C  -3.70441 1.449152 -1.879147
C  -3.78798 -0.651569 0.312344
C  -0.842967 1.809655 0.627132
C  -4.109932 -1.947483 0.377909
C  1.438427 1.263079 0.943035
C  -5.447672 -2.381266 0.89709
C  -3.209779 -3.07092 -0.040087
C  2.148183 2.043081 -0.158085
C  2.226682 -0.00886 1.098297
C  3.315658 -0.023069 0.31418
C  3.351672 1.196408 -0.49861
C  1.775956 -1.058203 2.042112
C  4.33244 -1.112941 0.191069
C  3.840221 -2.186974 -0.733346
C  3.592253 -3.437812 -0.364486
H  -1.663079 -0.778356 -0.143022
H  -2.968492 1.926314 0.6210
H  -0.412692 0.336023 -1.844545
H  -1.611807 0.275436 -3.123725
H  -0.98977 1.831384 -2.58699
H  -3.526137 2.410256 -2.364804
H  -4.068449 0.757177 -2.641486
H  -4.501663 1.591147 -1.150894
H  -4.531594 0.071571 0.635343
H  1.426543 1.808343 1.890657
H  -6.001508 -2.938469 0.137149
H  -5.336089 -3.054449 1.751173
H  -6.062004 -1.537641 1.211489
H  -2.277339 -2.740798 -0.495961
H  -2.958502 -3.704729 0.815904
H  -3.71868 -3.716917 -0.761067
H  2.462228 3.036555 0.163601
H  1.525907 2.1715 -1.04675
H  0.925182 -1.604598 1.627347
H  1.439374 -0.616509 2.981339
H  2.55866 -1.782783 2.257751
H  5.266018 -0.692963 -0.192489
H  4.552082 -1.539022 1.171862
H  3.664227 -1.886177 -1.761989
H  3.222509 -4.171655 -1.068998
H  3.751094 -3.774571 0.65366
elementType: O C H
totalener: -965.41736892 hartree
nucrepener: 1823.50852136 hartree
electener: -2788.92589028 hartree
oneelecener: -4932.73055424 hartree
twoeener: 2143.80466396 hartree
cpcmener: -0.03774916 hartree
kineticenergy: 960.99387258 hartree
xcener: -95.139034201428 hartree
chargesum: 0.0000000
charge: -0.282950 -0.495911 -0.486017 0.121122 0.070834 -0.133401 -0.287981 -0.272308 -0.309622 0.421687 -0.037547 0.225985 -0.224322 -0.257684 -0.149704 -0.040879 -0.070589 0.330411 -0.273461 -0.100408 -0.178714 -0.289700 0.098738 0.094299 0.087755 0.100150 0.103646 0.098800 0.096423 0.089587 0.122437 0.113578 0.094389 0.093734 0.089157 0.090759 0.098528 0.095593 0.111521 0.107879 0.115071 0.120660 0.102587 0.095713 0.106918 0.144891 0.132297 0.116047
qa: -0.2830 -0.4959 -0.4860 0.1211 0.0708 -0.1334 -0.2880 -0.2723 -0.3096 0.4217 -0.0375 0.2260 -0.2243 -0.2577 -0.1497 -0.0409 -0.0706 0.3304 -0.2735 -0.1004 -0.1787 -0.2897 0.0987 0.0943 0.0878 0.1002 0.1036 0.0988 0.0964 0.0896 0.1224 0.1136 0.0944 0.0937 0.0892 0.0908 0.0985 0.0956 0.1115 0.1079 0.1151 0.1207 0.1026 0.0957 0.1069 0.1449 0.1323 0.1160
va: 2.1187 2.0009 2.0098 3.6741 3.7286 3.8979 3.9050 3.9053 3.8579 4.1370 3.7385 3.7486 3.9235 3.9438 3.9072 3.7662 3.4644 4.0319 3.9541 3.8543 3.7872 3.9415 1.0159 1.0336 1.0151 1.0025 0.9982 1.0016 1.0023 1.0050 1.0088 1.0154 0.9964 0.9954 1.0085 1.0088 0.9962 0.9975 1.0210 1.0213 0.9965 1.0015 1.0037 1.0238 1.0053 1.0031 1.0033 1.0088
dispcorr: -0.023439886 hartree
energy: -965.440808806978
dipole: -18.32388 16.84293 -1.48095 -17.53434 15.48371 -2.05063 -2.79978 3.74842 0.94865
magnitude: 2.70152 au
magnitude: 6.86672 debye
