program: Orca
programVersion: 5.0.2
elementType: O O O C C C C C C C C C C C C C C C C C C C H H H H H H H H H H H H H H H H H H H H H H H H H H
charge: 0
multiplicity: 1
keywords: wb97x-d3
keywords: def2-TZVPP
keywords: def2/J RIJCOSX
keywords: DEFGRID2
keywords: scfconv7
keywords: smallprint printgap noloewdin
keywords: NOSOSCF
formula: C19H26O3
InChI: InChI=1/C19H26O3/c1-7-8-13-12(4)16(10-15(13)20)22-18(21)17-14(9-11(2)3)19(17,5)6/h7,9,14,16-17H,1,8,10H2,2-6H3
48 atoms
O  -0.02639 0.783908 0.095911
O  -0.85778 2.844917 -0.087656
O  4.372973 1.323275 -1.173977
C  -2.395843 0.253387 -1.935127
C  -2.494679 -0.479563 -0.639475
C  -2.257908 1.016802 -0.625566
C  -1.185625 0.024359 -2.80689
C  -3.649265 0.548721 -2.721184
C  -3.768288 -1.03914 -0.119763
C  -0.996509 1.645105 -0.192692
C  -3.984457 -1.333326 1.165038
C  1.231598 1.308915 0.530935
C  -5.266657 -1.956249 1.623749
C  -2.966408 -1.091002 2.237784
C  2.08274 1.879954 -0.596206
C  2.026748 0.156304 1.083093
C  3.246199 0.080321 0.527216
C  3.379967 1.11265 -0.5050
C  1.459795 -0.703772 2.148446
C  4.333714 -0.899541 0.835077
C  4.117824 -2.19339 0.107449
C  3.977289 -3.372186 0.701163
H  -1.61464 -1.067478 -0.394716
H  -3.113846 1.638015 -0.385441
H  -0.92301 0.927537 -3.36101
H  -0.30882 -0.295744 -2.246797
H  -1.403223 -0.756315 -3.538234
H  -3.496405 1.412669 -3.370297
H  -3.91416 -0.298338 -3.357061
H  -4.504368 0.766318 -2.081498
H  -4.552177 -1.250788 -0.841122
H  1.060155 2.043942 1.322513
H  -5.079828 -2.90685 2.130088
H  -5.775153 -1.316619 2.349519
H  -5.952026 -2.143484 0.797416
H  -2.16662 -0.420731 1.925158
H  -3.434744 -0.664155 3.127441
H  -2.504809 -2.031354 2.552723
H  2.260789 2.951018 -0.499616
H  1.629117 1.711582 -1.576273
H  2.192516 -1.399952 2.551233
H  0.616302 -1.286411 1.770656
H  1.073738 -0.09228 2.966812
H  5.29395 -0.46897 0.537486
H  4.388064 -1.082222 1.909869
H  4.06877 -2.129302 -0.975637
H  3.825614 -4.278388 0.128819
H  4.022789 -3.477395 1.779153
elementType: O C H
totalener: -965.41568557 hartree
nucrepener: 1832.60560151 hartree
electener: -2798.02128708 hartree
oneelecener: -4950.84706452 hartree
twoeener: 2152.82577745 hartree
cpcmener: -0.03686942 hartree
kineticenergy: 961.00213453 hartree
xcener: -95.140174994860 hartree
chargesum: -0.0000000
charge: -0.283584 -0.497785 -0.485633 0.156512 -0.009889 -0.107188 -0.272752 -0.301354 -0.305755 0.414645 -0.009720 0.224779 -0.226920 -0.251107 -0.143117 -0.050809 -0.055038 0.324419 -0.269927 -0.098820 -0.183812 -0.288202 0.108117 0.094838 0.103165 0.085442 0.098215 0.099026 0.100354 0.091743 0.126873 0.113008 0.095002 0.095443 0.088964 0.072279 0.096467 0.106553 0.107998 0.108399 0.101393 0.110660 0.121473 0.095954 0.105370 0.145823 0.132243 0.116256
qa: -0.2836 -0.4978 -0.4856 0.1565 -0.0099 -0.1072 -0.2728 -0.3014 -0.3058 0.4146 -0.0097 0.2248 -0.2269 -0.2511 -0.1431 -0.0508 -0.0550 0.3244 -0.2699 -0.0988 -0.1838 -0.2882 0.1081 0.0948 0.1032 0.0854 0.0982 0.0990 0.1004 0.0917 0.1269 0.1130 0.0950 0.0954 0.0890 0.0723 0.0965 0.1066 0.1080 0.1084 0.1014 0.1107 0.1215 0.0960 0.1054 0.1458 0.1322 0.1163
va: 2.1106 1.9999 2.0105 3.7133 3.7935 3.8493 3.8818 3.9105 3.8609 4.1215 3.6969 3.7445 3.9299 3.9450 3.9065 3.7703 3.4419 4.0382 3.9521 3.8524 3.7932 3.9403 1.0148 1.0285 0.9989 1.0154 1.0027 1.0020 0.9989 1.0013 1.0029 1.0162 0.9947 0.9965 1.0069 1.0135 1.0015 0.9964 1.0230 1.0194 1.0076 0.9994 0.9983 1.0237 1.0049 1.0027 1.0032 1.0090
dispcorr: -0.024287137 hartree
energy: -965.439972704107
dipole: -17.12891 15.47967 -1.64925 -15.07104 13.25966 -1.81138 3.45552 -2.07744 1.37809
magnitude: 2.81074 au
magnitude: 7.14433 debye
