program: Orca
programVersion: 5.0.2
elementType: O O O C C C C C C C C C C C C C C C C C C C H H H H H H H H H H H H H H H H H H H H H H H H H H
charge: 0
multiplicity: 1
keywords: wb97x-d3
keywords: def2-TZVPP
keywords: def2/J RIJCOSX
keywords: DEFGRID2
keywords: scfconv7
keywords: smallprint printgap noloewdin
keywords: NOSOSCF
formula: C19H26O3
InChI: InChI=1/C19H26O3/c1-7-8-13-12(4)16(10-15(13)20)22-18(21)17-14(9-11(2)3)19(17,5)6/h7,9,14,16-17H,1,8,10H2,2-6H3
48 atoms
O  0.055646 1.469633 -0.682115
O  0.262237 -0.758673 -0.650695
O  4.633869 0.274089 -1.145034
C  -2.591877 -0.614084 -2.004334
C  -2.713659 -0.9595 -0.562802
C  -1.886857 0.249941 -0.964881
C  -1.799934 -1.518997 -2.914557
C  -3.754475 0.053917 -2.698284
C  -3.970937 -0.771149 0.20608
C  -0.4314 0.227856 -0.758945
C  -4.027482 -0.465056 1.504942
C  1.440725 1.685172 -0.41277
C  -5.335949 -0.313781 2.21741
C  -2.812086 -0.238389 2.34946
C  2.427513 1.228409 -1.481975
C  1.937663 1.070235 0.870438
C  3.172694 0.5624 0.722538
C  3.564494 0.631201 -0.686481
C  1.133167 1.143833 2.112345
C  4.065564 -0.009396 1.769686
C  3.905385 -1.482323 2.00589
C  3.007171 -2.280503 1.442513
H  -2.107958 -1.808744 -0.254533
H  -2.346166 1.21721 -0.796992
H  -1.32953 -0.951685 -3.719666
H  -1.024419 -2.078199 -2.395891
H  -2.470435 -2.246833 -3.375445
H  -4.473341 -0.691343 -3.044284
H  -4.283118 0.753232 -2.050853
H  -3.409327 0.60851 -3.572365
H  -4.902517 -0.92012 -0.332744
H  1.493323 2.770429 -0.299557
H  -5.430936 0.685116 2.650833
H  -6.186213 -0.47764 1.555901
H  -5.412589 -1.018554 3.049136
H  -2.829563 -0.885132 3.230107
H  -1.878434 -0.422093 1.820604
H  -2.78939 0.788522 2.724003
H  2.783286 2.049061 -2.105444
H  2.01266 0.473262 -2.15143
H  0.648277 2.115707 2.212726
H  1.735882 0.960581 3.000114
H  0.338082 0.39348 2.099131
H  5.10899 0.186437 1.504452
H  3.912945 0.509928 2.720482
H  4.606198 -1.902178 2.72097
H  2.970906 -3.333728 1.689073
H  2.278865 -1.925862 0.72421
elementType: O C H
totalener: -965.41511242 hartree
nucrepener: 1859.21322826 hartree
electener: -2824.62834067 hartree
oneelecener: -5005.13445416 hartree
twoeener: 2180.50611349 hartree
cpcmener: -0.03769562 hartree
kineticenergy: 960.99794410 hartree
xcener: -95.144959894507 hartree
chargesum: 0.0000000
charge: -0.300454 -0.508695 -0.490066 0.154608 -0.018967 -0.105400 -0.280704 -0.289090 -0.305765 0.410710 -0.011113 0.303817 -0.232121 -0.228885 -0.159606 -0.001902 -0.145787 0.322981 -0.277589 -0.091980 -0.184709 -0.288227 0.104064 0.090785 0.100530 0.090769 0.097404 0.099859 0.093343 0.098472 0.125105 0.122133 0.095847 0.090638 0.096606 0.102687 0.067060 0.102518 0.108150 0.115004 0.122325 0.112140 0.119378 0.090693 0.104674 0.134852 0.131552 0.112358
qa: -0.3005 -0.5087 -0.4901 0.1546 -0.0190 -0.1054 -0.2807 -0.2891 -0.3058 0.4107 -0.0111 0.3038 -0.2321 -0.2289 -0.1596 -0.0019 -0.1458 0.3230 -0.2776 -0.0920 -0.1847 -0.2882 0.1041 0.0908 0.1005 0.0908 0.0974 0.0999 0.0933 0.0985 0.1251 0.1221 0.0958 0.0906 0.0966 0.1027 0.0671 0.1025 0.1082 0.1150 0.1223 0.1121 0.1194 0.0907 0.1047 0.1349 0.1316 0.1124
va: 2.1319 1.9827 2.0060 3.6984 3.8075 3.8232 3.8921 3.9097 3.8908 4.0959 3.7083 3.7385 3.9299 3.9304 3.8782 3.6671 3.4582 4.0235 3.9381 3.8376 3.8326 3.8908 1.0257 1.0344 0.9991 1.0191 1.0009 0.9993 1.0018 1.0028 1.0032 0.9925 0.9961 1.0058 0.9960 1.0008 1.0157 0.9971 1.0248 1.0266 1.0007 1.0031 0.9918 1.0168 1.0026 1.0000 1.0047 1.0246
dispcorr: -0.025224246 hartree
energy: -965.440336661391
dipole: -21.48707 18.93424 -2.55283 -3.92437 5.58803 1.66366 7.04372 -5.76569 1.27802
magnitude: 3.30425 au
magnitude: 8.39874 debye
