program: Orca
programVersion: 5.0.2
elementType: O O O C C C C C C C C C C C C C C C C C C C H H H H H H H H H H H H H H H H H H H H H H H H H H
charge: 0
multiplicity: 1
keywords: wb97x-d3
keywords: def2-TZVPP
keywords: def2/J RIJCOSX
keywords: DEFGRID2
keywords: scfconv7
keywords: smallprint printgap noloewdin
keywords: NOSOSCF
formula: C19H26O3
InChI: InChI=1/C19H26O3/c1-7-8-13-12(4)16(10-15(13)20)22-18(21)17-14(9-11(2)3)19(17,5)6/h7,9,14,16-17H,1,8,10H2,2-6H3
48 atoms
O  0.018905 -0.323285 0.857752
O  -0.344095 -2.462817 1.407741
O  4.106787 1.885563 0.772236
C  -2.960138 0.023674 1.648975
C  -2.772067 0.070829 0.161423
C  -2.207048 -1.095794 0.949571
C  -2.23137 1.034692 2.500742
C  -4.306953 -0.355375 2.216536
C  -3.870512 -0.19912 -0.790106
C  -0.767036 -1.370037 1.098126
C  -4.240938 0.570221 -1.818941
C  1.439759 -0.46976 0.936178
C  -5.36208 0.152242 -2.722674
C  -3.607362 1.878762 -2.179007
C  2.081921 0.776115 1.527236
C  2.031156 -0.597187 -0.445829
C  3.049181 0.260432 -0.624714
C  3.213824 1.083593 0.57785
C  1.518421 -1.616547 -1.391397
C  3.97783 0.386372 -1.78882
C  5.254072 -0.357237 -1.522454
C  6.441776 0.214498 -1.369359
H  -2.036717 0.797328 -0.165308
H  -2.769895 -2.020161 0.876943
H  -2.890393 1.881891 2.699242
H  -1.9518 0.606696 3.465445
H  -1.333132 1.429919 2.031943
H  -4.201286 -0.709831 3.243502
H  -4.970936 0.511088 2.233459
H  -4.800792 -1.141856 1.647679
H  -4.417298 -1.124579 -0.632019
H  1.690167 -1.355196 1.523834
H  -6.169548 0.888799 -2.713864
H  -5.022385 0.080995 -3.75927
H  -5.781922 -0.812676 -2.439595
H  -3.153484 1.828277 -3.171687
H  -4.364188 2.665135 -2.228464
H  -2.841554 2.204585 -1.478378
H  2.437119 0.641748 2.548494
H  1.384565 1.617959 1.526975
H  1.572316 -2.611985 -0.946001
H  2.074807 -1.631311 -2.325882
H  0.467879 -1.433943 -1.628514
H  3.502165 -0.008929 -2.688799
H  4.192567 1.440389 -1.978163
H  5.160963 -1.435972 -1.436566
H  7.328575 -0.37208 -1.1664
H  6.571713 1.288301 -1.437663
elementType: O C H
totalener: -965.41642441 hartree
nucrepener: 1800.73959245 hartree
electener: -2766.15601686 hartree
oneelecener: -4887.28241661 hartree
twoeener: 2121.12639975 hartree
cpcmener: -0.03861158 hartree
kineticenergy: 960.99617944 hartree
xcener: -95.141461478116 hartree
chargesum: -0.0000000
charge: -0.286058 -0.496805 -0.485511 0.107620 0.074443 -0.132914 -0.274412 -0.271864 -0.309586 0.430093 -0.040312 0.219679 -0.222873 -0.255035 -0.136270 -0.013764 -0.083026 0.309351 -0.246891 -0.110702 -0.176311 -0.288629 0.097561 0.088762 0.096318 0.101910 0.087141 0.098649 0.097328 0.089047 0.121761 0.109030 0.094581 0.093433 0.089688 0.098059 0.095293 0.089794 0.099774 0.107323 0.114626 0.104956 0.113633 0.110526 0.099720 0.144937 0.131453 0.114476
qa: -0.2861 -0.4968 -0.4855 0.1076 0.0744 -0.1329 -0.2744 -0.2719 -0.3096 0.4301 -0.0403 0.2197 -0.2229 -0.2550 -0.1363 -0.0138 -0.0830 0.3094 -0.2469 -0.1107 -0.1763 -0.2886 0.0976 0.0888 0.0963 0.1019 0.0871 0.0986 0.0973 0.0890 0.1218 0.1090 0.0946 0.0934 0.0897 0.0981 0.0953 0.0898 0.0998 0.1073 0.1146 0.1050 0.1136 0.1105 0.0997 0.1449 0.1315 0.1145
va: 2.1137 1.9995 2.0068 3.6976 3.7140 3.8906 3.9117 3.9099 3.8622 4.1344 3.7466 3.7632 3.9217 3.9443 3.9363 3.7485 3.4448 4.0483 3.9389 3.8693 3.7735 3.9538 1.0276 1.0354 1.0008 0.9993 1.0110 1.0015 1.0019 1.0056 1.0099 1.0334 0.9962 0.9957 1.0084 0.9962 0.9975 1.0095 1.0242 1.0235 1.0034 1.0058 0.9989 1.0055 1.0176 0.9999 1.0029 1.0125
dispcorr: -0.022747087 hartree
energy: -965.439171495904
dipole: -19.02385 16.97899 -2.04486 3.53461 -3.65864 -0.12403 -8.13070 7.15368 -0.97702
magnitude: 2.26967 au
magnitude: 5.76903 debye
