program: Orca
programVersion: 5.0.2
elementType: O O O C C C C C C C C C C C C C C C C C C C H H H H H H H H H H H H H H H H H H H H H H H H H H
charge: 0
multiplicity: 1
keywords: wb97x-d3
keywords: def2-TZVPP
keywords: def2/J RIJCOSX
keywords: DEFGRID2
keywords: scfconv7
keywords: smallprint printgap noloewdin
keywords: NOSOSCF
formula: C19H26O3
InChI: InChI=1/C19H26O3/c1-7-8-13-12(4)16(10-15(13)20)22-18(21)17-14(9-11(2)3)19(17,5)6/h7,9,14,16-17H,1,8,10H2,2-6H3
48 atoms
O  0.303972 0.649514 -0.250322
O  -0.674572 -0.157974 1.597977
O  4.545123 2.362333 -0.823813
C  -2.606151 -1.384126 -0.575193
C  -3.271003 -0.244928 0.134813
C  -1.890132 -0.045881 -0.460237
C  -2.146907 -2.570544 0.237047
C  -3.058351 -1.767525 -1.963148
C  -4.405975 0.502771 -0.441897
C  -0.725502 0.127947 0.422973
C  -5.526558 0.865084 0.19174
C  1.551121 0.865837 0.417306
C  -6.592887 1.639703 -0.523418
C  -5.838639 0.562847 1.625499
C  2.23274 2.109618 -0.133497
C  2.506246 -0.265312 0.125252
C  3.671014 0.184513 -0.36931
C  3.621855 1.643892 -0.491526
C  2.142407 -1.668581 0.431442
C  4.893021 -0.612759 -0.702066
C  5.713115 -0.879368 0.525436
C  6.007096 -2.09007 0.98323
H  -3.274292 -0.344664 1.214713
H  -1.841213 0.517527 -1.385543
H  -1.946596 -2.331167 1.278841
H  -2.92279 -3.338218 0.225258
H  -1.244252 -3.01321 -0.189799
H  -3.323114 -0.908825 -2.578018
H  -2.268618 -2.312829 -2.482798
H  -3.930811 -2.421551 -1.909862
H  -4.304919 0.788762 -1.484904
H  1.388697 0.94715 1.494103
H  -7.53693 1.088917 -0.534659
H  -6.79575 2.586445 -0.016006
H  -6.320168 1.862348 -1.554868
H  -5.09998 -0.067085 2.117271
H  -5.924367 1.487544 2.202923
H  -6.806435 0.061626 1.707417
H  2.263749 2.933838 0.57913
H  1.734934 2.474223 -1.03504
H  1.918813 -1.779694 1.494648
H  2.938469 -2.364762 0.176897
H  1.244587 -1.972248 -0.112277
H  4.615278 -1.555759 -1.176367
H  5.49238 -0.057356 -1.428725
H  6.069908 -0.003735 1.059936
H  6.600628 -2.226412 1.878054
H  5.669569 -2.988588 0.479296
elementType: O C H
totalener: -965.41899719 hartree
nucrepener: 1772.62641359 hartree
electener: -2738.04541078 hartree
oneelecener: -4831.27880840 hartree
twoeener: 2093.23339762 hartree
cpcmener: -0.03530807 hartree
kineticenergy: 960.98965163 hartree
xcener: -95.139768624718 hartree
chargesum: -0.0000000
charge: -0.293602 -0.494345 -0.488872 0.113084 0.038231 -0.088258 -0.284579 -0.271472 -0.289133 0.392948 -0.047987 0.247357 -0.218879 -0.253971 -0.140562 -0.043715 -0.063121 0.326403 -0.249058 -0.104354 -0.183851 -0.290032 0.092859 0.090960 0.094288 0.101494 0.095355 0.089557 0.097992 0.097743 0.122167 0.108245 0.094075 0.093328 0.088691 0.090773 0.098235 0.095066 0.099538 0.104019 0.119436 0.099070 0.117035 0.105844 0.097929 0.145181 0.132304 0.116583
qa: -0.2936 -0.4943 -0.4889 0.1131 0.0382 -0.0883 -0.2846 -0.2715 -0.2891 0.3929 -0.0480 0.2474 -0.2189 -0.2540 -0.1406 -0.0437 -0.0631 0.3264 -0.2491 -0.1044 -0.1839 -0.2900 0.0929 0.0910 0.0943 0.1015 0.0954 0.0896 0.0980 0.0977 0.1222 0.1082 0.0941 0.0933 0.0887 0.0908 0.0982 0.0951 0.0995 0.1040 0.1194 0.0991 0.1170 0.1058 0.0979 0.1452 0.1323 0.1166
va: 2.1238 2.0014 2.0037 3.6747 3.7836 3.8415 3.9024 3.9071 3.8744 4.1683 3.7554 3.7639 3.9200 3.9413 3.9354 3.7673 3.4422 4.0290 3.9288 3.8659 3.7900 3.9431 1.0317 1.0359 1.0165 1.0017 1.0010 1.0060 1.0014 1.0015 1.0099 1.0288 0.9964 0.9959 1.0087 1.0096 0.9961 0.9975 1.0241 1.0265 1.0014 1.0090 1.0012 1.0037 1.0228 1.0039 1.0031 1.0087
dispcorr: -0.022326169 hartree
energy: -965.441323361866
dipole: -21.94272 20.11908 -1.82364 -11.79361 10.43520 -1.35841 -0.10377 -0.25512 -0.35889
magnitude: 2.30211 au
magnitude: 5.85151 debye
