program: Orca
programVersion: 5.0.2
elementType: O O O C C C C C C C C C C C C C C C C C C C H H H H H H H H H H H H H H H H H H H H H H H H H H
charge: 0
multiplicity: 1
keywords: wb97x-d3
keywords: def2-TZVPP
keywords: def2/J RIJCOSX
keywords: DEFGRID2
keywords: scfconv7
keywords: smallprint printgap noloewdin
keywords: NOSOSCF
formula: C19H26O3
InChI: InChI=1/C19H26O3/c1-7-8-13-12(4)16(10-15(13)20)22-18(21)17-14(9-11(2)3)19(17,5)6/h7,9,14,16-17H,1,8,10H2,2-6H3
48 atoms
O  0.305121 1.683264 -0.561058
O  0.247325 -0.553356 -0.503148
O  4.576986 -0.203313 -1.333878
C  -2.593543 -0.031949 -1.788081
C  -2.724555 -0.428224 -0.350046
C  -1.780683 0.698103 -0.730715
C  -1.924941 -0.99581 -2.737275
C  -3.684551 0.777908 -2.446508
C  -3.911006 -0.118416 0.470858
C  -0.327914 0.507776 -0.588315
C  -4.508852 -0.939563 1.340957
C  1.724119 1.730468 -0.400087
C  -5.695023 -0.481973 2.135567
C  -4.078636 -2.346028 1.628469
C  2.556896 1.12631 -1.526281
C  2.235127 1.082442 0.862274
C  3.360086 0.384922 0.634835
C  3.633066 0.351969 -0.8037
C  1.555336 1.315071 2.157344
C  4.247128 -0.295351 1.620552
C  3.962102 -1.75366 1.830136
C  2.944527 -2.44029 1.325448
H  -2.217534 -1.355846 -0.10752
H  -2.123552 1.704158 -0.516975
H  -1.221483 -1.664417 -2.246012
H  -2.683013 -1.617879 -3.216716
H  -1.391775 -0.462778 -3.526901
H  -3.294266 1.297507 -3.323321
H  -4.492093 0.124894 -2.783077
H  -4.116147 1.52914 -1.786658
H  -4.319931 0.881731 0.361048
H  1.91809 2.80252 -0.324915
H  -6.570687 -1.100929 1.925231
H  -5.504132 -0.574096 3.207937
H  -5.956729 0.555245 1.927859
H  -3.316872 -2.723724 0.950163
H  -3.687157 -2.428316 2.645266
H  -4.932737 -3.024256 1.573637
H  3.00287 1.88639 -2.168411
H  1.988708 0.456584 -2.173085
H  2.158279 0.987719 3.001719
H  0.610106 0.768819 2.199088
H  1.314386 2.371045 2.288567
H  5.288862 -0.190774 1.301475
H  4.195698 0.20962 2.58949
H  4.673737 -2.264072 2.47164
H  2.822874 -3.492833 1.546465
H  2.197228 -1.991235 0.683523
elementType: O C H
totalener: -965.41683908 hartree
nucrepener: 1832.06120522 hartree
electener: -2797.47804431 hartree
oneelecener: -4951.06575052 hartree
twoeener: 2153.58770622 hartree
cpcmener: -0.03890451 hartree
kineticenergy: 960.99797729 hartree
xcener: -95.145352087412 hartree
chargesum: -0.0000000
charge: -0.300778 -0.506506 -0.488200 0.102675 0.040550 -0.104174 -0.277390 -0.272792 -0.287357 0.425105 -0.044419 0.301149 -0.219479 -0.258150 -0.154469 0.003627 -0.154020 0.317540 -0.260152 -0.091856 -0.186599 -0.289213 0.091245 0.088811 0.091314 0.098250 0.099375 0.098512 0.097864 0.089684 0.121363 0.121972 0.094522 0.093272 0.088822 0.091963 0.100378 0.094466 0.110132 0.113096 0.105451 0.116767 0.118924 0.093613 0.103295 0.135354 0.131779 0.114688
qa: -0.3008 -0.5065 -0.4882 0.1027 0.0405 -0.1042 -0.2774 -0.2728 -0.2874 0.4251 -0.0444 0.3011 -0.2195 -0.2581 -0.1545 0.0036 -0.1540 0.3175 -0.2602 -0.0919 -0.1866 -0.2892 0.0912 0.0888 0.0913 0.0983 0.0994 0.0985 0.0979 0.0897 0.1214 0.1220 0.0945 0.0933 0.0888 0.0920 0.1004 0.0945 0.1101 0.1131 0.1055 0.1168 0.1189 0.0936 0.1033 0.1354 0.1318 0.1147
va: 2.1348 1.9912 2.0070 3.7012 3.7662 3.8541 3.9059 3.9097 3.8812 4.1167 3.7530 3.7382 3.9212 3.9425 3.8743 3.6713 3.4628 4.0335 3.9400 3.8386 3.8297 3.8912 1.0338 1.0384 1.0190 1.0004 0.9995 1.0014 1.0014 1.0063 1.0107 0.9917 0.9965 0.9954 1.0088 1.0088 0.9957 0.9978 1.0231 1.0268 1.0029 0.9995 0.9993 1.0135 1.0028 1.0000 1.0045 1.0235
dispcorr: -0.023551185 hartree
energy: -965.440390269429
dipole: -23.67295 21.46219 -2.21076 -5.65017 7.52121 1.87104 6.07526 -4.84871 1.22655
magnitude: 3.14526 au
magnitude: 7.99462 debye
