program: Orca
programVersion: 5.0.2
elementType: O O O C C C C C C C C C C C C C C C C C C C H H H H H H H H H H H H H H H H H H H H H H H H H H
charge: 0
multiplicity: 1
keywords: wb97x-d3
keywords: def2-TZVPP
keywords: def2/J RIJCOSX
keywords: DEFGRID2
keywords: scfconv7
keywords: smallprint printgap noloewdin
keywords: NOSOSCF
formula: C19H26O3
InChI: InChI=1/C19H26O3/c1-7-8-13-12(4)16(10-15(13)20)22-18(21)17-14(9-11(2)3)19(17,5)6/h7,9,14,16-17H,1,8,10H2,2-6H3
48 atoms
O  -0.144431 0.47032 0.369784
O  -0.729742 2.208358 1.639949
O  4.230368 1.33023 -0.87461
C  -2.710092 1.498169 -1.183751
C  -2.776428 0.09502 -0.67843
C  -2.378818 1.204878 0.272353
C  -1.608488 1.871497 -2.145946
C  -3.986524 2.269074 -1.412887
C  -4.053696 -0.636413 -0.480346
C  -1.021544 1.358268 0.827102
C  -4.189394 -1.717647 0.292216
C  1.20138 0.543122 0.843894
C  -5.495857 -2.440561 0.40557
C  -3.065276 -2.302488 1.091538
C  2.042634 1.601573 0.142434
C  1.865126 -0.769094 0.525252
C  3.031475 -0.591594 -0.115095
C  3.247629 0.839257 -0.35422
C  1.242718 -2.039997 0.96607
C  4.055603 -1.612532 -0.493244
C  5.131077 -1.67606 0.552056
C  6.400529 -1.343438 0.354757
H  -1.948761 -0.530001 -1.000441
H  -3.137373 1.537296 0.972709
H  -1.318223 2.916666 -2.022568
H  -0.716291 1.257762 -2.033789
H  -1.957514 1.7479 -3.17281
H  -3.798147 3.342841 -1.36075
H  -4.392972 2.054087 -2.403149
H  -4.755774 2.03475 -0.677435
H  -4.921948 -0.280177 -1.02716
H  1.196295 0.685259 1.92829
H  -5.392209 -3.485321 0.101286
H  -5.846475 -2.455077 1.440609
H  -6.272817 -1.986447 -0.209199
H  -2.786384 -3.286307 0.704473
H  -2.170759 -1.681196 1.097831
H  -3.371287 -2.457624 2.128899
H  2.341233 2.421333 0.795741
H  1.513716 2.03639 -0.709636
H  1.910287 -2.89112 0.851208
H  0.334553 -2.245642 0.394409
H  0.943609 -1.975187 2.014091
H  3.583392 -2.591911 -0.596252
H  4.490298 -1.3642 -1.463755
H  4.81056 -2.00644 1.535989
H  7.12912 -1.404158 1.15306
H  6.759521 -1.003579 -0.609694
elementType: O C H
totalener: -965.41565314 hartree
nucrepener: 1819.72515544 hartree
electener: -2785.14080858 hartree
oneelecener: -4925.15917048 hartree
twoeener: 2140.01836190 hartree
cpcmener: -0.03935838 hartree
kineticenergy: 961.00866231 hartree
xcener: -95.141776874400 hartree
chargesum: -0.0000000
charge: -0.281906 -0.497348 -0.483969 0.152659 -0.010930 -0.111078 -0.271834 -0.301701 -0.296658 0.418684 -0.018987 0.215195 -0.231081 -0.229599 -0.136224 -0.026361 -0.063513 0.312700 -0.273667 -0.105698 -0.178482 -0.286470 0.106544 0.095663 0.103403 0.085053 0.098963 0.098899 0.101212 0.091048 0.127383 0.111179 0.094650 0.095544 0.089676 0.103538 0.059835 0.096649 0.106253 0.110159 0.107277 0.107345 0.117110 0.110020 0.097958 0.144454 0.131729 0.114725
qa: -0.2819 -0.4973 -0.4840 0.1527 -0.0109 -0.1111 -0.2718 -0.3017 -0.2967 0.4187 -0.0190 0.2152 -0.2311 -0.2296 -0.1362 -0.0264 -0.0635 0.3127 -0.2737 -0.1057 -0.1785 -0.2865 0.1065 0.0957 0.1034 0.0851 0.0990 0.0989 0.1012 0.0910 0.1274 0.1112 0.0947 0.0955 0.0897 0.1035 0.0598 0.0966 0.1063 0.1102 0.1073 0.1073 0.1171 0.1100 0.0980 0.1445 0.1317 0.1147
va: 2.1114 1.9998 2.0097 3.7209 3.7913 3.8477 3.8811 3.9105 3.8585 4.1232 3.7145 3.7645 3.9305 3.9392 3.9158 3.7297 3.4574 4.0511 3.9561 3.8616 3.7776 3.9538 1.0172 1.0284 0.9991 1.0146 1.0026 1.0022 0.9985 1.0014 1.0023 1.0187 0.9953 0.9964 1.0066 0.9978 1.0189 1.0012 1.0249 1.0183 1.0063 0.9992 0.9961 1.0051 1.0192 1.0000 1.0026 1.0118
dispcorr: -0.024106619 hartree
energy: -965.439759757617
dipole: -16.53938 14.57543 -1.96396 -11.33449 9.09442 -2.24007 -2.73484 2.80495 0.07011
magnitude: 2.97993 au
magnitude: 7.57437 debye
