program: Orca
programVersion: 5.0.2
elementType: O O O C C C C C C C C C C C C C C C C C C C H H H H H H H H H H H H H H H H H H H H H H H H H H
charge: 0
multiplicity: 1
keywords: wb97x-d3
keywords: def2-TZVPP
keywords: def2/J RIJCOSX
keywords: DEFGRID2
keywords: scfconv7
keywords: smallprint printgap noloewdin
keywords: NOSOSCF
formula: C19H26O3
InChI: InChI=1/C19H26O3/c1-7-8-13-12(4)16(10-15(13)20)22-18(21)17-14(9-11(2)3)19(17,5)6/h7,9,14,16-17H,1,8,10H2,2-6H3
48 atoms
O  0.102651 -0.339007 0.622759
O  -0.261423 -0.947546 2.738923
O  4.210726 1.872359 0.74276
C  -2.816221 0.853844 1.280888
C  -2.692706 -0.00919 0.054081
C  -2.130492 -0.497213 1.360919
C  -1.99611 2.117745 1.346937
C  -4.153706 0.965406 1.968042
C  -3.858562 -0.70362 -0.541334
C  -0.686948 -0.616349 1.654849
C  -4.447804 -0.371301 -1.693881
C  1.515562 -0.460007 0.799329
C  -5.610731 -1.153969 -2.223702
C  -4.028054 0.787853 -2.544944
C  2.170533 0.754806 1.442756
C  2.142478 -0.56865 -0.563563
C  3.173578 0.278465 -0.704259
C  3.317161 1.08009 0.514311
C  1.667227 -1.587533 -1.527592
C  4.121493 0.381447 -1.84776
C  5.285987 -0.562973 -1.765033
C  5.490923 -1.484587 -0.831711
H  -1.959112 0.350813 -0.659464
H  -2.706494 -1.253879 1.884869
H  -1.066041 2.052946 0.783047
H  -2.566697 2.951354 0.933016
H  -1.747176 2.371518 2.37945
H  -4.775132 1.71648 1.475485
H  -4.705086 0.025459 1.965176
H  -4.027064 1.271747 3.008208
H  -4.256399 -1.54903 0.0130
H  1.732118 -1.373486 1.36078
H  -6.487624 -0.514525 -2.353153
H  -5.385521 -1.569703 -3.209216
H  -5.887695 -1.97779 -1.566259
H  -3.175336 1.334126 -2.146601
H  -3.775339 0.458266 -3.55565
H  -4.853143 1.496756 -2.650598
H  2.520008 0.577194 2.459266
H  1.484915 1.606089 1.471932
H  2.277794 -1.621647 -2.427006
H  0.634184 -1.39589 -1.823734
H  1.681245 -2.57705 -1.06538
H  3.598555 0.204982 -2.79194
H  4.505693 1.402869 -1.92105
H  6.00899 -0.458812 -2.567947
H  6.363259 -2.124082 -0.867365
H  4.810046 -1.642241 -0.00374
elementType: O C H
totalener: -965.41646776 hartree
nucrepener: 1809.38286672 hartree
electener: -2774.79933448 hartree
oneelecener: -4904.52102805 hartree
twoeener: 2129.72169357 hartree
cpcmener: -0.03933516 hartree
kineticenergy: 961.00937142 hartree
xcener: -95.143712136289 hartree
chargesum: -0.0000000
charge: -0.283126 -0.494257 -0.483273 0.148489 0.025947 -0.155581 -0.287048 -0.270222 -0.294418 0.430871 -0.030663 0.227419 -0.228832 -0.253908 -0.126603 -0.055674 -0.074080 0.324707 -0.255722 -0.078909 -0.189511 -0.280611 0.100439 0.100211 0.084379 0.099209 0.102849 0.095340 0.090914 0.098375 0.124196 0.109528 0.093915 0.095275 0.089629 0.088975 0.097137 0.097297 0.101980 0.108307 0.099939 0.114554 0.115784 0.104287 0.093081 0.133800 0.133752 0.111856
qa: -0.2831 -0.4943 -0.4833 0.1485 0.0259 -0.1556 -0.2870 -0.2702 -0.2944 0.4309 -0.0307 0.2274 -0.2288 -0.2539 -0.1266 -0.0557 -0.0741 0.3247 -0.2557 -0.0789 -0.1895 -0.2806 0.1004 0.1002 0.0844 0.0992 0.1028 0.0953 0.0909 0.0984 0.1242 0.1095 0.0939 0.0953 0.0896 0.0890 0.0971 0.0973 0.1020 0.1083 0.0999 0.1146 0.1158 0.1043 0.0931 0.1338 0.1338 0.1119
va: 2.1237 2.0023 2.0131 3.6959 3.7323 3.9398 3.9040 3.8985 3.8549 4.1379 3.7126 3.7502 3.9258 3.9436 3.9105 3.7632 3.4489 4.0431 3.9535 3.8308 3.8302 3.9019 1.0148 1.0312 1.0139 1.0022 1.0002 1.0029 1.0025 1.0029 1.0072 1.0212 0.9961 0.9954 1.0079 1.0086 0.9976 0.9972 1.0269 1.0174 1.0043 1.0011 0.9966 1.0003 1.0175 1.0021 1.0037 1.0158
dispcorr: -0.023586514 hartree
energy: -965.440054271775
dipole: -20.38601 18.40912 -1.97688 -0.17987 -0.62645 -0.80632 -11.70992 9.64546 -2.06446
magnitude: 2.96988 au
magnitude: 7.54884 debye
