program: Orca
programVersion: 5.0.2
elementType: O O O C C C C C C C C C C C C C C C C C C C H H H H H H H H H H H H H H H H H H H H H H H H H H
charge: 0
multiplicity: 1
keywords: wb97x-d3
keywords: def2-TZVPP
keywords: def2/J RIJCOSX
keywords: DEFGRID2
keywords: scfconv7
keywords: smallprint printgap noloewdin
keywords: NOSOSCF
formula: C19H26O3
InChI: InChI=1/C19H26O3/c1-7-8-13-12(4)16(10-15(13)20)22-18(21)17-14(9-11(2)3)19(17,5)6/h7,9,14,16-17H,1,8,10H2,2-6H3
48 atoms
O  -0.006276 0.927875 -0.020376
O  -0.61916 2.905429 -0.848983
O  4.452432 0.663416 -1.182737
C  -2.329096 -0.09772 -1.804832
C  -2.617711 -0.211531 -0.338088
C  -2.172753 1.122685 -0.91282
C  -1.116708 -0.80958 -2.355368
C  -3.466804 -0.033412 -2.795281
C  -3.976836 -0.34169 0.219504
C  -0.87508 1.746497 -0.601225
C  -4.28664 -1.069327 1.297205
C  1.292692 1.430216 0.301362
C  -5.69326 -1.140903 1.806749
C  -3.264375 -1.859936 2.072236
C  2.216124 1.56763 -0.902375
C  1.94934 0.408081 1.190068
C  3.166378 0.066148 0.739494
C  3.428245 0.745572 -0.533191
C  1.259632 -0.076135 2.408989
C  4.145701 -0.891511 1.3362
C  3.919309 -2.275778 0.802657
C  4.769156 -2.933428 0.024112
H  -1.850638 -0.739834 0.217247
H  -2.950541 1.866895 -1.045409
H  -0.33942 -0.979867 -1.613711
H  -1.413448 -1.786467 -2.741544
H  -0.678188 -0.251076 -3.184947
H  -3.131537 0.424709 -3.727494
H  -3.825549 -1.037341 -3.030582
H  -4.313875 0.547107 -2.432779
H  -4.769818 0.206709 -0.279693
H  1.189741 2.373468 0.845532
H  -5.754807 -0.779736 2.836745
H  -6.382409 -0.55271 1.200979
H  -6.052042 -2.173369 1.822926
H  -2.467651 -1.226383 2.468074
H  -3.720831 -2.36951 2.920271
H  -2.785997 -2.624591 1.457426
H  2.495061 2.599292 -1.116671
H  1.76567 1.154682 -1.808644
H  1.925452 -0.634343 3.064276
H  0.427177 -0.7331 2.144767
H  0.83513 0.757492 2.971265
H  5.163462 -0.565698 1.11139
H  4.043192 -0.896414 2.424073
H  2.975157 -2.737182 1.077863
H  4.547675 -3.929727 -0.336741
H  5.718122 -2.504538 -0.276316
elementType: O C H
totalener: -965.41630708 hartree
nucrepener: 1822.80998354 hartree
electener: -2788.22629062 hartree
oneelecener: -4931.29963008 hartree
twoeener: 2143.07333947 hartree
cpcmener: -0.03976590 hartree
kineticenergy: 961.00288922 hartree
xcener: -95.141072485490 hartree
chargesum: 0.0000000
charge: -0.285096 -0.498849 -0.483499 0.099841 0.071842 -0.104621 -0.277490 -0.284504 -0.320966 0.423053 -0.004659 0.218811 -0.226628 -0.287038 -0.139636 -0.031709 -0.071055 0.316083 -0.265980 -0.102976 -0.181139 -0.284479 0.094343 0.091211 0.087907 0.098566 0.101835 0.098507 0.097558 0.090929 0.119967 0.114124 0.097438 0.085194 0.097828 0.100010 0.096886 0.105232 0.107548 0.108405 0.105398 0.108534 0.118152 0.090088 0.113614 0.144799 0.132174 0.114452
qa: -0.2851 -0.4988 -0.4835 0.0998 0.0718 -0.1046 -0.2775 -0.2845 -0.3210 0.4231 -0.0047 0.2188 -0.2266 -0.2870 -0.1396 -0.0317 -0.0711 0.3161 -0.2660 -0.1030 -0.1811 -0.2845 0.0943 0.0912 0.0879 0.0986 0.1018 0.0985 0.0976 0.0909 0.1200 0.1141 0.0974 0.0852 0.0978 0.1000 0.0969 0.1052 0.1075 0.1084 0.1054 0.1085 0.1182 0.0901 0.1136 0.1448 0.1322 0.1145
va: 2.1152 2.0001 2.0108 3.7019 3.7333 3.8625 3.9030 3.9161 3.8929 4.1479 3.6885 3.7607 3.9224 3.9433 3.9068 3.7587 3.4613 4.0502 3.9571 3.8563 3.7875 3.9477 1.0137 1.0316 1.0154 1.0015 0.9989 1.0007 1.0010 1.0069 1.0107 1.0156 0.9926 1.0099 0.9924 0.9966 1.0052 0.9950 1.0236 1.0204 1.0050 0.9977 0.9989 1.0239 1.0048 0.9997 1.0023 1.0124
dispcorr: -0.023466610 hartree
energy: -965.439773687285
dipole: -17.92423 16.00635 -1.91789 -15.44418 14.02305 -1.42113 4.98126 -3.16075 1.82051
magnitude: 3.00203 au
magnitude: 7.63054 debye
