program: Orca
programVersion: 5.0.2
elementType: O O O C C C C C C C C C C C C C C C C C C C H H H H H H H H H H H H H H H H H H H H H H H H H H
charge: 0
multiplicity: 1
keywords: wb97x-d3
keywords: def2-TZVPP
keywords: def2/J RIJCOSX
keywords: DEFGRID2
keywords: scfconv7
keywords: smallprint printgap noloewdin
keywords: NOSOSCF
formula: C19H26O3
InChI: InChI=1/C19H26O3/c1-7-8-13-12(4)16(10-15(13)20)22-18(21)17-14(9-11(2)3)19(17,5)6/h7,9,14,16-17H,1,8,10H2,2-6H3
48 atoms
O  0.421249 0.659909 -0.10141
O  -0.779513 0.465911 1.782698
O  4.713772 2.036002 -0.877197
C  -2.370629 -1.487196 -0.163916
C  -3.166648 -0.254892 0.150626
C  -1.738668 -0.115021 -0.333235
C  -1.954954 -2.381591 0.977938
C  -2.631871 -2.250201 -1.439079
C  -4.256624 0.238965 -0.713059
C  -0.686418 0.359861 0.580842
C  -5.438584 0.718263 -0.311236
C  1.588966 1.112537 0.592472
C  -6.436255 1.22188 -1.310974
C  -5.883459 0.823662 1.11596
C  2.361568 2.082208 -0.289088
C  2.537116 -0.037725 0.836129
C  3.760667 0.217196 0.345484
C  3.754819 1.509104 -0.347401
C  2.094146 -1.250341 1.564645
C  4.980021 -0.635392 0.397543
C  5.179836 -1.492033 -0.819459
C  4.324729 -1.648102 -1.822914
H  -3.290866 -0.075113 1.212993
H  -1.605677 0.191381 -1.365089
H  -1.86327 -1.857122 1.92666
H  -2.69929 -3.168418 1.113847
H  -1.000551 -2.868558 0.766159
H  -3.48311 -2.922452 -1.314026
H  -2.840723 -1.601425 -2.288245
H  -1.765386 -2.860784 -1.698901
H  -4.059679 0.224215 -1.781167
H  1.304362 1.571915 1.54137
H  -6.068931 1.14689 -2.334246
H  -7.374371 0.664861 -1.245774
H  -6.686844 2.268519 -1.118807
H  -5.216447 0.336263 1.82409
H  -5.97654 1.871543 1.413332
H  -6.875007 0.382399 1.23955
H  2.373427 3.099628 0.102468
H  1.946998 2.126197 -1.298569
H  1.300741 -1.7657 1.017449
H  1.683277 -0.986928 2.540977
H  2.905475 -1.959905 1.712471
H  5.863287 -0.002107 0.523857
H  4.962843 -1.280228 1.280378
H  6.123428 -2.027979 -0.844853
H  4.560147 -2.29957 -2.654455
H  3.364559 -1.146787 -1.857803
elementType: O C H
totalener: -965.41918351 hartree
nucrepener: 1793.99291311 hartree
electener: -2759.41209662 hartree
oneelecener: -4874.12123373 hartree
twoeener: 2114.70913711 hartree
cpcmener: -0.03724531 hartree
kineticenergy: 960.99674805 hartree
xcener: -95.142852504972 hartree
chargesum: -0.0000000
charge: -0.290736 -0.490996 -0.482370 0.117169 0.034919 -0.087931 -0.290305 -0.272807 -0.287128 0.389090 -0.048629 0.254785 -0.218419 -0.256652 -0.139437 -0.014268 -0.105116 0.312734 -0.261832 -0.072160 -0.189356 -0.278647 0.090799 0.092032 0.094286 0.103680 0.096924 0.098108 0.090037 0.097694 0.120590 0.111229 0.088604 0.093988 0.093118 0.091868 0.099592 0.094663 0.102863 0.102765 0.115847 0.121096 0.106525 0.093578 0.102165 0.133884 0.133861 0.108298
qa: -0.2907 -0.4910 -0.4824 0.1172 0.0349 -0.0879 -0.2903 -0.2728 -0.2871 0.3891 -0.0486 0.2548 -0.2184 -0.2567 -0.1394 -0.0143 -0.1051 0.3127 -0.2618 -0.0722 -0.1894 -0.2786 0.0908 0.0920 0.0943 0.1037 0.0969 0.0981 0.0900 0.0977 0.1206 0.1112 0.0886 0.0940 0.0931 0.0919 0.0996 0.0947 0.1029 0.1028 0.1158 0.1211 0.1065 0.0936 0.1022 0.1339 0.1339 0.1083
va: 2.1282 2.0057 2.0133 3.6718 3.7891 3.8241 3.9051 3.9053 3.8790 4.1834 3.7570 3.7432 3.9200 3.9409 3.9104 3.7125 3.4652 4.0363 3.9325 3.8249 3.8343 3.8996 1.0321 1.0353 1.0152 1.0020 0.9999 1.0014 1.0063 1.0016 1.0107 1.0265 1.0088 0.9966 0.9954 1.0089 0.9957 0.9977 1.0225 1.0286 0.9950 1.0035 1.0068 1.0155 1.0032 1.0021 1.0034 1.0203
dispcorr: -0.022968252 hartree
energy: -965.442151759568
dipole: -22.62106 21.03904 -1.58202 -11.95368 10.58704 -1.36664 -1.42708 1.73019 0.30310
magnitude: 2.11243 au
magnitude: 5.36937 debye
