program: Orca
programVersion: 5.0.2
elementType: O O O C C C C C C C C C C C C C C C C C C C H H H H H H H H H H H H H H H H H H H H H H H H H H
charge: 0
multiplicity: 1
keywords: wb97x-d3
keywords: def2-TZVPP
keywords: def2/J RIJCOSX
keywords: DEFGRID2
keywords: scfconv7
keywords: smallprint printgap noloewdin
keywords: NOSOSCF
formula: C19H26O3
InChI: InChI=1/C19H26O3/c1-7-8-13-12(4)16(10-15(13)20)22-18(21)17-14(9-11(2)3)19(17,5)6/h7,9,14,16-17H,1,8,10H2,2-6H3
48 atoms
O  0.358049 0.560685 -0.127831
O  -0.827912 0.397148 1.767672
O  4.646991 1.958865 -0.922692
C  -2.560585 -1.49496 -0.075431
C  -3.255443 -0.185141 0.138948
C  -1.814044 -0.195175 -0.33075
C  -2.229777 -2.341628 1.12859
C  -2.879551 -2.317244 -1.300069
C  -4.296565 0.335049 -0.767747
C  -0.745914 0.273661 0.566439
C  -5.460067 0.858144 -0.370113
C  1.528905 1.026007 0.552204
C  -6.452634 1.37958 -1.362693
C  -5.858786 0.956758 1.078603
C  2.292886 1.990064 -0.34319
C  2.48477 -0.115513 0.807061
C  3.705995 0.143475 0.312271
C  3.691101 1.430873 -0.389127
C  2.049801 -1.31849 1.55526
C  4.939367 -0.698623 0.360871
C  5.097714 -1.468057 -0.917622
C  6.048144 -1.248347 -1.816982
H  -3.3805 0.077685 1.184634
H  -1.652084 0.029384 -1.379099
H  -2.117338 -1.765983 2.04454
H  -3.031225 -3.063633 1.295846
H  -1.30912 -2.907212 0.968549
H  -2.068735 -3.017025 -1.509993
H  -3.786866 -2.902643 -1.138477
H  -3.028524 -1.710555 -2.192135
H  -4.084713 0.293707 -1.831987
H  1.249259 1.495421 1.497468
H  -7.413769 0.868205 -1.264584
H  -6.65239 2.440957 -1.193133
H  -6.109794 1.260961 -2.390505
H  -6.792549 1.505731 1.194615
H  -6.007312 -0.02785 1.525596
H  -5.106223 1.468187 1.680601
H  2.293706 3.013467 0.032479
H  1.879046 2.015217 -1.353788
H  1.25905 -1.846347 1.017916
H  1.639038 -1.041575 2.527126
H  2.865171 -2.020618 1.71499
H  5.81183 -0.062426 0.522514
H  4.88822 -1.389493 1.204256
H  4.353507 -2.236935 -1.101167
H  6.104436 -1.824827 -2.730606
H  6.8026 -0.483453 -1.675849
elementType: O C H
totalener: -965.41764813 hartree
nucrepener: 1777.72275058 hartree
electener: -2743.14039870 hartree
oneelecener: -4841.65260135 hartree
twoeener: 2098.51220264 hartree
cpcmener: -0.03674465 hartree
kineticenergy: 961.01551653 hartree
xcener: -95.143846102692 hartree
chargesum: -0.0000000
charge: -0.292076 -0.495244 -0.484538 0.119961 0.041783 -0.102212 -0.286203 -0.272538 -0.307206 0.398843 -0.018899 0.250310 -0.220468 -0.283976 -0.139387 -0.027596 -0.071403 0.304093 -0.258087 -0.103239 -0.177974 -0.285281 0.092986 0.090547 0.093567 0.100949 0.095199 0.098073 0.097732 0.089648 0.120943 0.108121 0.098322 0.096350 0.085648 0.096363 0.107789 0.100871 0.102373 0.103425 0.113035 0.117549 0.105999 0.096293 0.110484 0.144158 0.131597 0.113318
qa: -0.2921 -0.4952 -0.4845 0.1200 0.0418 -0.1022 -0.2862 -0.2725 -0.3072 0.3988 -0.0189 0.2503 -0.2205 -0.2840 -0.1394 -0.0276 -0.0714 0.3041 -0.2581 -0.1032 -0.1780 -0.2853 0.0930 0.0905 0.0936 0.1009 0.0952 0.0981 0.0977 0.0896 0.1209 0.1081 0.0983 0.0963 0.0856 0.0964 0.1078 0.1009 0.1024 0.1034 0.1130 0.1175 0.1060 0.0963 0.1105 0.1442 0.1316 0.1133
va: 2.1280 2.0000 2.0074 3.6760 3.7743 3.8695 3.9047 3.9090 3.8844 4.1610 3.7030 3.7590 3.9175 3.9381 3.9267 3.7526 3.4534 4.0492 3.9343 3.8607 3.7822 3.9474 1.0266 1.0360 1.0169 1.0016 1.0011 1.0016 1.0013 1.0058 1.0093 1.0265 0.9930 0.9929 1.0100 1.0041 0.9945 0.9987 1.0229 1.0291 0.9974 1.0039 1.0075 1.0198 1.0067 1.0003 1.0029 1.0137
dispcorr: -0.022363783 hartree
energy: -965.440011909193
dipole: -21.77645 19.97139 -1.80506 -10.96252 9.58224 -1.38028 -0.93435 1.22670 0.29235
magnitude: 2.29104 au
magnitude: 5.82337 debye
