program: Orca
programVersion: 5.0.2
elementType: O O O C C C C C C C C C C C C C C C C C C C H H H H H H H H H H H H H H H H H H H H H H H H H H
charge: 0
multiplicity: 1
keywords: wb97x-d3
keywords: def2-TZVPP
keywords: def2/J RIJCOSX
keywords: DEFGRID2
keywords: scfconv7
keywords: smallprint printgap noloewdin
keywords: NOSOSCF
formula: C19H26O3
InChI: InChI=1/C19H26O3/c1-7-8-13-12(4)16(10-15(13)20)22-18(21)17-14(9-11(2)3)19(17,5)6/h7,9,14,16-17H,1,8,10H2,2-6H3
48 atoms
O  0.305009 0.656361 -0.26139
O  -0.674491 -0.116246 1.601051
O  4.525695 2.464669 -0.769368
C  -2.608479 -1.411242 -0.50615
C  -3.268146 -0.223161 0.125927
C  -1.878283 -0.077745 -0.466602
C  -2.168042 -2.552484 0.378346
C  -3.057741 -1.873418 -1.870995
C  -4.393201 0.493644 -0.504334
C  -0.721875 0.136072 0.418247
C  -5.500649 0.890346 0.129944
C  1.546127 0.894959 0.409143
C  -6.595754 1.604523 -0.601154
C  -5.739051 0.646011 1.596774
C  2.2070 2.155571 -0.126722
C  2.523232 -0.214663 0.110785
C  3.689124 0.262546 -0.354846
C  3.61329 1.722606 -0.460092
C  2.172651 -1.628948 0.378822
C  4.927094 -0.513961 -0.680391
C  5.658765 -0.929971 0.56131
C  5.945198 -2.187096 0.876323
H  -3.288392 -0.254877 1.210681
H  -1.815043 0.431428 -1.421808
H  -1.993182 -2.258859 1.410595
H  -2.942839 -3.321322 0.388147
H  -1.254952 -3.014763 -0.003358
H  -2.279844 -2.475674 -2.34357
H  -3.949674 -2.497027 -1.78332
H  -3.291396 -1.051202 -2.54568
H  -4.302038 0.708894 -1.564667
H  1.380823 0.962959 1.486286
H  -7.538415 1.055918 -0.526931
H  -6.780258 2.589624 -0.164626
H  -6.36654 1.740643 -1.657962
H  -4.918191 1.011675 2.215861
H  -6.646169 1.145235 1.936131
H  -5.855318 -0.416808 1.817957
H  2.205098 2.980044 0.586236
H  1.71742 2.507533 -1.037923
H  2.983593 -2.309089 0.12848
H  1.291744 -1.930344 -0.193296
H  1.923908 -1.766413 1.433265
H  4.676859 -1.39417 -1.276277
H  5.582677 0.107043 -1.296904
H  5.957268 -0.128361 1.230463
H  6.479351 -2.435009 1.784538
H  5.66506 -3.013799 0.233577
elementType: O C H
totalener: -965.41738129 hartree
nucrepener: 1773.51207462 hartree
electener: -2738.92945591 hartree
oneelecener: -4833.05037879 hartree
twoeener: 2094.12092288 hartree
cpcmener: -0.03482900 hartree
kineticenergy: 960.99081952 hartree
xcener: -95.139621666774 hartree
chargesum: -0.0000000
charge: -0.295627 -0.495553 -0.488000 0.111837 0.043350 -0.091571 -0.282457 -0.273336 -0.311109 0.392758 -0.015823 0.248683 -0.220518 -0.284562 -0.140970 -0.043828 -0.071234 0.327437 -0.247501 -0.092749 -0.186591 -0.288982 0.094403 0.090654 0.093692 0.100097 0.095765 0.098095 0.097774 0.089468 0.121116 0.107925 0.098310 0.096059 0.085430 0.101445 0.095865 0.107966 0.099008 0.104191 0.099245 0.116264 0.119310 0.106008 0.093325 0.145680 0.132329 0.116921
qa: -0.2956 -0.4956 -0.4880 0.1118 0.0434 -0.0916 -0.2825 -0.2733 -0.3111 0.3928 -0.0158 0.2487 -0.2205 -0.2846 -0.1410 -0.0438 -0.0712 0.3274 -0.2475 -0.0927 -0.1866 -0.2890 0.0944 0.0907 0.0937 0.1001 0.0958 0.0981 0.0978 0.0895 0.1211 0.1079 0.0983 0.0961 0.0854 0.1014 0.0959 0.1080 0.0990 0.1042 0.0992 0.1163 0.1193 0.1060 0.0933 0.1457 0.1323 0.1169
va: 2.1226 1.9999 2.0067 3.6799 3.7805 3.8595 3.9023 3.9109 3.8915 4.1673 3.6984 3.7586 3.9179 3.9382 3.9331 3.7600 3.4525 4.0268 3.9272 3.8565 3.7942 3.9375 1.0262 1.0361 1.0176 1.0015 1.0011 1.0014 1.0010 1.0063 1.0090 1.0301 0.9928 0.9932 1.0099 0.9983 1.0041 0.9940 1.0244 1.0262 1.0087 1.0027 1.0019 1.0046 1.0250 1.0027 1.0032 1.0086
dispcorr: -0.022377197 hartree
energy: -965.439758482174
dipole: -21.78216 19.97343 -1.80873 -12.27670 10.83321 -1.44349 -0.12111 -0.26015 -0.38125
magnitude: 2.34532 au
magnitude: 5.96134 debye
