program: Orca
programVersion: 5.0.2
elementType: O O O C C C C C C C C C C C C C C C C C C C H H H H H H H H H H H H H H H H H H H H H H H H H H
charge: 0
multiplicity: 1
keywords: wb97x-d3
keywords: def2-TZVPP
keywords: def2/J RIJCOSX
keywords: DEFGRID2
keywords: scfconv7
keywords: smallprint printgap noloewdin
keywords: NOSOSCF
formula: C19H26O3
InChI: InChI=1/C19H26O3/c1-7-8-13-12(4)16(10-15(13)20)22-18(21)17-14(9-11(2)3)19(17,5)6/h7,9,14,16-17H,1,8,10H2,2-6H3
48 atoms
O  0.358702 0.673624 -0.101988
O  -0.847703 0.564524 1.786259
O  4.704781 1.861267 -0.909173
C  -2.464257 -1.397494 -0.140631
C  -3.251121 -0.157129 0.170394
C  -1.825635 -0.029448 -0.317998
C  -2.051709 -2.288516 1.004714
C  -2.738174 -2.164734 -1.410437
C  -4.343338 0.326433 -0.697368
C  -0.758369 0.430024 0.58707
C  -5.556272 0.732211 -0.307453
C  1.550228 1.081387 0.579502
C  -6.560802 1.20763 -1.31434
C  -6.043332 0.752953 1.10909
C  2.357703 2.009414 -0.315617
C  2.449338 -0.107002 0.827953
C  3.678582 0.089557 0.323978
C  3.725992 1.378889 -0.373324
C  1.958386 -1.285556 1.580664
C  4.867489 -0.814972 0.363962
C  4.998972 -1.570447 -0.926472
C  5.981682 -1.400089 -1.801975
H  -3.375772 0.025781 1.232378
H  -1.693771 0.270671 -1.351953
H  -1.105902 -2.790442 0.789242
H  -1.944888 -1.757849 1.948516
H  -2.805768 -3.063794 1.15302
H  -1.882025 -2.791659 -1.665628
H  -3.600854 -2.821465 -1.281439
H  -2.935577 -1.517898 -2.263842
H  -4.124275 0.356822 -1.760917
H  1.293752 1.560142 1.526817
H  -6.171908 1.174965 -2.33185
H  -7.469076 0.600352 -1.279972
H  -6.870089 2.234755 -1.103885
H  -5.294641 0.450984 1.839147
H  -6.391118 1.753089 1.380535
H  -6.903686 0.088608 1.2252
H  2.414008 3.029429 0.065104
H  1.939983 2.060208 -1.323529
H  1.139141 -1.775438 1.048409
H  1.566296 -0.985972 2.55429
H  2.737961 -2.027933 1.737554
H  5.770193 -0.226685 0.544191
H  4.774788 -1.518575 1.193844
H  4.208785 -2.28495 -1.138017
H  6.022135 -1.967901 -2.722643
H  6.784019 -0.69198 -1.629843
elementType: O C H
totalener: -965.41892428 hartree
nucrepener: 1779.09859858 hartree
electener: -2744.51752286 hartree
oneelecener: -4844.33402805 hartree
twoeener: 2099.81650519 hartree
cpcmener: -0.03757073 hartree
kineticenergy: 960.99727357 hartree
xcener: -95.140890671602 hartree
chargesum: -0.0000000
charge: -0.287857 -0.489962 -0.484319 0.122665 0.031832 -0.093824 -0.295041 -0.270855 -0.284380 0.391346 -0.054058 0.246111 -0.218172 -0.251079 -0.140985 -0.024169 -0.070657 0.304103 -0.264416 -0.104312 -0.178466 -0.285032 0.093101 0.092507 0.097465 0.094665 0.104585 0.097700 0.098074 0.089823 0.120845 0.108986 0.088459 0.093301 0.093849 0.089955 0.095061 0.097666 0.102559 0.103755 0.116483 0.118138 0.106835 0.097103 0.110768 0.144428 0.131353 0.114064
qa: -0.2879 -0.4900 -0.4843 0.1227 0.0318 -0.0938 -0.2950 -0.2709 -0.2844 0.3913 -0.0541 0.2461 -0.2182 -0.2511 -0.1410 -0.0242 -0.0707 0.3041 -0.2644 -0.1043 -0.1785 -0.2850 0.0931 0.0925 0.0975 0.0947 0.1046 0.0977 0.0981 0.0898 0.1208 0.1090 0.0885 0.0933 0.0938 0.0900 0.0951 0.0977 0.1026 0.1038 0.1165 0.1181 0.1068 0.0971 0.1108 0.1444 0.1314 0.1141
va: 2.1269 2.0071 2.0080 3.6626 3.7918 3.8265 3.9060 3.9038 3.8675 4.1849 3.7638 3.7599 3.9193 3.9396 3.9276 3.7420 3.4503 4.0502 3.9318 3.8604 3.7808 3.9479 1.0306 1.0353 0.9995 1.0148 1.0021 1.0018 1.0016 1.0061 1.0103 1.0262 1.0089 0.9960 0.9962 1.0102 0.9968 0.9968 1.0228 1.0290 0.9956 1.0035 1.0085 1.0189 1.0071 1.0003 1.0029 1.0129
dispcorr: -0.022486105 hartree
energy: -965.441410382087
dipole: -21.97309 20.18006 -1.79303 -11.65771 10.27016 -1.38755 -1.34730 1.60768 0.26038
magnitude: 2.28212 au
magnitude: 5.80069 debye
