program: Orca
programVersion: 5.0.2
elementType: O O O C C C C C C C C C C C C C C C C C C C H H H H H H H H H H H H H H H H H H H H H H H H H H
charge: 0
multiplicity: 1
keywords: wb97x-d3
keywords: def2-TZVPP
keywords: def2/J RIJCOSX
keywords: DEFGRID2
keywords: scfconv7
keywords: smallprint printgap noloewdin
keywords: NOSOSCF
formula: C19H26O3
InChI: InChI=1/C19H26O3/c1-7-8-13-12(4)16(10-15(13)20)22-18(21)17-14(9-11(2)3)19(17,5)6/h7,9,14,16-17H,1,8,10H2,2-6H3
48 atoms
O  0.424504 0.592999 -0.073293
O  -0.770064 0.395471 1.814595
O  4.669964 2.105107 -0.867243
C  -2.42638 -1.536764 -0.061511
C  -3.173111 -0.256439 0.15987
C  -1.727508 -0.206741 -0.295846
C  -2.087361 -2.379912 1.142623
C  -2.687356 -2.361779 -1.298047
C  -4.228066 0.223369 -0.752982
C  -0.679059 0.284229 0.612913
C  -5.389562 0.787897 -0.404201
C  1.58958 1.061356 0.614479
C  -6.373799 1.219622 -1.449625
C  -5.838163 1.035074 1.004278
C  2.323852 2.075071 -0.250369
C  2.56967 -0.07038 0.813891
C  3.778407 0.227918 0.310759
C  3.730427 1.539738 -0.342165
C  2.162789 -1.307553 1.52248
C  5.024719 -0.586684 0.324658
C  5.265173 -1.363619 -0.937377
C  4.422901 -1.496785 -1.954917
H  -3.311009 -0.013141 1.207751
H  -1.561607 0.032344 -1.340418
H  -1.149731 -2.919791 0.993743
H  -2.005465 -1.805224 2.062366
H  -2.871298 -3.124213 1.294935
H  -1.848327 -3.033839 -1.486766
H  -3.579374 -2.977252 -1.166243
H  -2.827721 -1.756606 -2.192425
H  -4.029976 0.100658 -1.81392
H  1.307961 1.486941 1.579853
H  -6.030086 0.994931 -2.459086
H  -7.339749 0.728957 -1.303937
H  -6.562958 2.294489 -1.388199
H  -6.184804 2.066025 1.1211
H  -6.691054 0.394593 1.252007
H  -5.066113 0.857933 1.752302
H  2.314814 3.081364 0.169146
H  1.893959 2.135818 -1.252559
H  2.99085 -2.002606 1.644321
H  1.372019 -1.827269 0.975387
H  1.760294 -1.072171 2.509506
H  5.884976 0.067773 0.496242
H  5.022221 -1.281648 1.168866
H  6.230109 -1.858348 -0.986367
H  4.690389 -2.088394 -2.820852
H  3.443507 -1.032988 -1.969835
elementType: O C H
totalener: -965.41932346 hartree
nucrepener: 1790.41403512 hartree
electener: -2755.83335858 hartree
oneelecener: -4866.99636152 hartree
twoeener: 2111.16300294 hartree
cpcmener: -0.03726716 hartree
kineticenergy: 960.98446274 hartree
xcener: -95.140519398509 hartree
chargesum: -0.0000000
charge: -0.293365 -0.493304 -0.482413 0.116403 0.026110 -0.084889 -0.283589 -0.273360 -0.282003 0.392097 -0.052567 0.254745 -0.216780 -0.254149 -0.139206 -0.009637 -0.108491 0.312226 -0.255983 -0.074484 -0.188730 -0.279419 0.096050 0.091002 0.094432 0.093125 0.101781 0.097789 0.097989 0.090075 0.120539 0.110490 0.088491 0.092985 0.094026 0.093068 0.100072 0.091058 0.102682 0.102592 0.106482 0.112803 0.119724 0.094855 0.102079 0.134138 0.134032 0.108428
qa: -0.2934 -0.4933 -0.4824 0.1164 0.0261 -0.0849 -0.2836 -0.2734 -0.2820 0.3921 -0.0526 0.2547 -0.2168 -0.2541 -0.1392 -0.0096 -0.1085 0.3122 -0.2560 -0.0745 -0.1887 -0.2794 0.0960 0.0910 0.0944 0.0931 0.1018 0.0978 0.0980 0.0901 0.1205 0.1105 0.0885 0.0930 0.0940 0.0931 0.1001 0.0911 0.1027 0.1026 0.1065 0.1128 0.1197 0.0949 0.1021 0.1341 0.1340 0.1084
va: 2.1263 2.0045 2.0129 3.6677 3.7990 3.8248 3.9032 3.9082 3.8748 4.1786 3.7636 3.7440 3.9192 3.9387 3.9114 3.7130 3.4632 4.0375 3.9328 3.8216 3.8328 3.9005 1.0265 1.0353 1.0014 1.0170 1.0013 1.0013 1.0012 1.0067 1.0108 1.0273 1.0088 0.9955 0.9967 0.9977 0.9957 1.0103 1.0225 1.0286 1.0062 0.9972 1.0032 1.0142 1.0040 1.0019 1.0032 1.0198
dispcorr: -0.022764212 hartree
energy: -965.442087674588
dipole: -22.58236 20.99777 -1.58458 -11.68623 10.24499 -1.44124 -1.58577 1.88197 0.29620
magnitude: 2.16236 au
magnitude: 5.49628 debye
