program: Orca
programVersion: 5.0.2
elementType: O O O C C C C C C C C C C C C C C C C C C C H H H H H H H H H H H H H H H H H H H H H H H H H H
charge: 0
multiplicity: 1
keywords: wb97x-d3
keywords: def2-TZVPP
keywords: def2/J RIJCOSX
keywords: DEFGRID2
keywords: scfconv7
keywords: smallprint printgap noloewdin
keywords: NOSOSCF
formula: C19H26O3
InChI: InChI=1/C19H26O3/c1-7-8-13-12(4)16(10-15(13)20)22-18(21)17-14(9-11(2)3)19(17,5)6/h7,9,14,16-17H,1,8,10H2,2-6H3
48 atoms
O  0.365088 0.548152 -0.101185
O  -0.757126 0.095807 1.78618
O  4.46799 2.512647 -0.754684
C  -2.531229 -1.601705 -0.178891
C  -3.21278 -0.303713 0.124784
C  -1.767528 -0.299264 -0.348011
C  -2.213942 -2.533386 0.964709
C  -2.854187 -2.33796 -1.456648
C  -4.246955 0.293082 -0.740619
C  -0.70238 0.117993 0.57712
C  -5.349672 0.9084 -0.302314
C  1.507466 1.044766 0.604269
C  -6.339233 1.495539 -1.261158
C  -5.685938 1.050646 1.158809
C  2.135635 2.194823 -0.16926
C  2.582604 -0.01038 0.677278
C  3.754399 0.441103 0.201192
C  3.586697 1.806972 -0.302877
C  2.298849 -1.34508 1.254122
C  5.056018 -0.291634 0.124795
C  5.096181 -1.198242 -1.069203
C  5.287311 -2.510215 -1.009094
H  -3.329601 -0.107854 1.185813
H  -1.60734 -0.003476 -1.378674
H  -1.288011 -3.08142 0.77785
H  -2.119523 -2.02682 1.922213
H  -3.014283 -3.268835 1.064505
H  -2.052695 -3.036257 -1.703821
H  -3.771916 -2.917598 -1.339158
H  -2.984547 -1.674655 -2.31032
H  -4.083133 0.232827 -1.812334
H  1.218427 1.352195 1.611299
H  -6.046005 1.347058 -2.30032
H  -7.330352 1.055764 -1.12221
H  -6.454829 2.569475 -1.092423
H  -4.865134 1.48116 1.73412
H  -6.55303 1.694508 1.301614
H  -5.923699 0.087951 1.615211
H  2.030153 3.157789 0.330411
H  1.698188 2.294814 -1.165255
H  3.197075 -1.950818 1.351661
H  1.592983 -1.894707 0.627079
H  1.837496 -1.250582 2.238147
H  5.868899 0.436718 0.057436
H  5.223798 -0.868832 1.035887
H  4.952527 -0.72214 -2.034559
H  5.306288 -3.119759 -1.902943
H  5.434409 -3.021695 -0.064902
elementType: O C H
totalener: -965.41739589 hartree
nucrepener: 1777.54603080 hartree
electener: -2742.96342668 hartree
oneelecener: -4841.20027224 hartree
twoeener: 2098.23684556 hartree
cpcmener: -0.03457760 hartree
kineticenergy: 961.00281057 hartree
xcener: -95.141401602684 hartree
chargesum: 0.0000000
charge: -0.294556 -0.498945 -0.487456 0.109182 0.039193 -0.094104 -0.278966 -0.273950 -0.305641 0.406548 -0.015303 0.250700 -0.221865 -0.285423 -0.141791 -0.038323 -0.070013 0.318451 -0.253537 -0.093768 -0.188219 -0.287237 0.093579 0.090175 0.096408 0.092318 0.098515 0.097585 0.097783 0.089687 0.120172 0.106177 0.085552 0.098799 0.095931 0.100469 0.096271 0.108029 0.101909 0.103066 0.101561 0.117596 0.118193 0.094869 0.105505 0.146194 0.132304 0.116377
qa: -0.2946 -0.4989 -0.4875 0.1092 0.0392 -0.0941 -0.2790 -0.2739 -0.3056 0.4065 -0.0153 0.2507 -0.2219 -0.2854 -0.1418 -0.0383 -0.0700 0.3185 -0.2535 -0.0938 -0.1882 -0.2872 0.0936 0.0902 0.0964 0.0923 0.0985 0.0976 0.0978 0.0897 0.1202 0.1062 0.0856 0.0988 0.0959 0.1005 0.0963 0.1080 0.1019 0.1031 0.1016 0.1176 0.1182 0.0949 0.1055 0.1462 0.1323 0.1164
va: 2.1266 1.9976 2.0072 3.6868 3.7840 3.8622 3.9039 3.9123 3.8992 4.1489 3.6993 3.7574 3.9187 3.9393 3.9221 3.7613 3.4532 4.0336 3.9281 3.8521 3.7960 3.9390 1.0259 1.0358 1.0010 1.0181 1.0006 1.0014 1.0009 1.0067 1.0100 1.0282 1.0101 0.9926 0.9931 0.9986 1.0039 0.9943 1.0228 1.0281 1.0070 0.9979 1.0078 1.0251 1.0046 1.0021 1.0033 1.0090
dispcorr: -0.022189467 hartree
energy: -965.439585352876
dipole: -21.47579 19.83104 -1.64475 -12.38549 10.99388 -1.39162 -1.24871 1.28861 0.03990
magnitude: 2.15485 au
magnitude: 5.47720 debye
