program: Orca
programVersion: 5.0.2
elementType: O O O C C C C C C C C C C C C C C C C C C C H H H H H H H H H H H H H H H H H H H H H H H H H H
charge: 0
multiplicity: 1
keywords: wb97x-d3
keywords: def2-TZVPP
keywords: def2/J RIJCOSX
keywords: DEFGRID2
keywords: scfconv7
keywords: smallprint printgap noloewdin
keywords: NOSOSCF
formula: C19H26O3
InChI: InChI=1/C19H26O3/c1-7-8-13-12(4)16(10-15(13)20)22-18(21)17-14(9-11(2)3)19(17,5)6/h7,9,14,16-17H,1,8,10H2,2-6H3
48 atoms
O  0.311675 0.549195 -0.287922
O  -0.655611 -0.259691 1.566085
O  4.562369 2.302791 -0.790802
C  -2.645841 -1.457331 -0.548795
C  -3.273962 -0.267586 0.109756
C  -1.882147 -0.144292 -0.486228
C  -2.238643 -2.627299 0.314104
C  -3.100521 -1.879891 -1.924739
C  -4.383258 0.492851 -0.495285
C  -0.713942 0.026305 0.391478
C  -5.425021 0.99023 0.178023
C  1.56741 0.750913 0.365805
C  -6.504649 1.754791 -0.524159
C  -5.591893 0.829419 1.666515
C  2.239153 2.01356 -0.151857
C  2.521442 -0.36572 0.023378
C  3.685189 0.104793 -0.4528
C  3.635575 1.5680 -0.507481
C  2.164538 -1.779317 0.28593
C  4.905902 -0.669063 -0.812068
C  5.778912 -1.025102 0.356107
C  5.514581 -0.804686 1.63811
H  -3.287379 -0.3197 1.193742
H  -1.813349 0.380645 -1.432181
H  -3.038922 -3.369879 0.314375
H  -1.342514 -3.112682 -0.07875
H  -2.050573 -2.356823 1.350538
H  -2.337207 -2.496819 -2.402018
H  -4.012464 -2.476259 -1.858025
H  -3.300231 -1.037889 -2.585844
H  -4.334613 0.661091 -1.566794
H  1.423619 0.79496 1.447481
H  -6.595906 2.766076 -0.118797
H  -6.322977 1.835864 -1.595713
H  -7.478406 1.279339 -0.380498
H  -6.524573 1.277317 2.008044
H  -5.607141 -0.21903 1.96854
H  -4.783564 1.308664 2.222226
H  2.251728 2.825809 0.574776
H  1.746325 2.386345 -1.053147
H  1.960772 -1.925255 1.349281
H  2.95904 -2.463806 -0.004893
H  1.256849 -2.066632 -0.250669
H  4.630504 -1.592267 -1.330996
H  5.502275 -0.104156 -1.53384
H  6.707521 -1.519756 0.089363
H  6.210341 -1.113205 2.407228
H  4.606631 -0.318186 1.974134
elementType: O C H
totalener: -965.41765885 hartree
nucrepener: 1783.53038434 hartree
electener: -2748.94804319 hartree
oneelecener: -4853.15894052 hartree
twoeener: 2104.21089732 hartree
cpcmener: -0.03666813 hartree
kineticenergy: 960.99736815 hartree
xcener: -95.142897124208 hartree
chargesum: -0.0000000
charge: -0.295151 -0.496142 -0.485857 0.109976 0.040764 -0.087913 -0.281516 -0.275633 -0.311260 0.393535 -0.009007 0.261614 -0.223808 -0.284356 -0.136956 -0.047532 -0.081039 0.323566 -0.248854 -0.084207 -0.188138 -0.282827 0.094342 0.090340 0.100504 0.095237 0.093177 0.097848 0.097757 0.090091 0.120290 0.106298 0.097912 0.085531 0.097128 0.096016 0.104083 0.102971 0.098382 0.103268 0.118378 0.104719 0.118278 0.105492 0.091663 0.134317 0.133088 0.113633
qa: -0.2952 -0.4961 -0.4859 0.1100 0.0408 -0.0879 -0.2815 -0.2756 -0.3113 0.3935 -0.0090 0.2616 -0.2238 -0.2844 -0.1370 -0.0475 -0.0810 0.3236 -0.2489 -0.0842 -0.1881 -0.2828 0.0943 0.0903 0.1005 0.0952 0.0932 0.0978 0.0978 0.0901 0.1203 0.1063 0.0979 0.0855 0.0971 0.0960 0.1041 0.1030 0.0984 0.1033 0.1184 0.1047 0.1183 0.1055 0.0917 0.1343 0.1331 0.1136
va: 2.1233 2.0003 2.0101 3.6793 3.7875 3.8498 3.9033 3.9119 3.9064 4.1695 3.6884 3.7580 3.9192 3.9404 3.9263 3.7471 3.4474 4.0279 3.9279 3.8465 3.8279 3.9044 1.0261 1.0361 1.0011 1.0014 1.0176 1.0012 1.0010 1.0065 1.0098 1.0331 0.9927 1.0099 0.9928 1.0045 0.9955 0.9964 1.0246 1.0269 1.0005 1.0050 1.0001 0.9994 1.0197 1.0018 1.0042 1.0140
dispcorr: -0.022786177 hartree
energy: -965.440445030867
dipole: -21.95100 20.18531 -1.76569 -10.30049 8.78556 -1.51492 0.54063 -1.05159 -0.51096
magnitude: 2.38196 au
magnitude: 6.05447 debye
