program: Orca
programVersion: 5.0.2
elementType: O O O C C C C C C C C C C C C C C C C C C C H H H H H H H H H H H H H H H H H H H H H H H H H H
charge: 0
multiplicity: 1
keywords: wb97x-d3
keywords: def2-TZVPP
keywords: def2/J RIJCOSX
keywords: DEFGRID2
keywords: scfconv7
keywords: smallprint printgap noloewdin
keywords: NOSOSCF
formula: C19H26O3
InChI: InChI=1/C19H26O3/c1-7-8-13-12(4)16(10-15(13)20)22-18(21)17-14(9-11(2)3)19(17,5)6/h7-9,14,16-17H,10H2,1-6H3
48 atoms
O  0.124424 0.25353 -0.874096
O  0.761997 2.359289 -1.301245
O  -4.031984 -1.687404 -1.23943
C  3.100565 -0.328298 -1.622451
C  2.782188 -0.581141 -0.186345
C  2.424839 0.756689 -0.799497
C  4.529097 -0.041043 -2.01964
C  2.334431 -1.077774 -2.685741
C  3.839877 -0.667829 0.853819
C  1.038497 1.222329 -1.024912
C  3.705163 -0.275605 2.121256
C  -1.251592 0.545986 -1.130578
C  4.820359 -0.431008 3.109778
C  2.450874 0.335404 2.666261
C  -1.925546 -0.645638 -1.788431
C  -2.003137 0.751317 0.15923
C  -3.089468 -0.043652 0.255042
C  -3.162896 -0.90603 -0.949578
C  -1.524904 1.774469 1.125016
C  -4.043521 -0.061049 1.350462
C  -5.117024 -0.847962 1.46269
C  -6.044821 -0.808654 2.62798
H  1.932783 -1.239642 -0.027118
H  3.074355 1.585474 -0.541682
H  5.080386 -0.970209 -2.179253
H  4.560072 0.524188 -2.952397
H  5.064161 0.537067 -1.266554
H  2.248597 -0.485708 -3.598791
H  2.86273 -1.998473 -2.940169
H  1.331869 -1.35626 -2.369762
H  4.781847 -1.117573 0.553201
H  -1.319837 1.447003 -1.746139
H  4.517105 -1.062742 3.948266
H  5.707748 -0.874367 2.659824
H  5.105017 0.534657 3.534898
H  2.649083 1.328526 3.076907
H  1.665564 0.430331 1.919008
H  2.056938 -0.267035 3.488571
H  -1.285174 -1.529746 -1.756064
H  -2.193103 -0.477749 -2.831684
H  -1.308428 2.714364 0.615694
H  -0.592458 1.454403 1.596421
H  -2.240794 1.971355 1.919307
H  -3.847845 0.639929 2.156894
H  -5.348844 -1.560618 0.682231
H  -5.74411 -0.067832 3.36898
H  -7.063039 -0.575039 2.309146
H  -6.092282 -1.781527 3.122513
totalener: -965.41078234 hartree
nucrepener: 1811.47935318 hartree
electener: -2776.89013552 hartree
oneelecener: -4908.92584227 hartree
twoeener: 2132.03570676 hartree
kineticenergy: 961.04168705 hartree
xcener: -95.144444179540 hartree
chargesum: 0.0000000
charge: -0.279877 -0.361057 -0.343149 0.128494 0.012417 -0.125813 -0.283260 -0.252979 -0.256137 0.330928 -0.012831 0.199399 -0.213856 -0.189266 -0.141040 -0.047256 -0.018430 0.224433 -0.245230 -0.204252 -0.045571 -0.207920 0.100187 0.090509 0.090642 0.094819 0.085873 0.096823 0.088098 0.075831 0.094693 0.101759 0.087191 0.078964 0.086166 0.090493 0.042487 0.093512 0.087374 0.090050 0.117321 0.096597 0.095231 0.074428 0.125326 0.069443 0.089730 0.088701
qa: -0.2799 -0.3611 -0.3431 0.1285 0.0124 -0.1258 -0.2833 -0.2530 -0.2561 0.3309 -0.0128 0.1994 -0.2139 -0.1893 -0.1410 -0.0473 -0.0184 0.2244 -0.2452 -0.2043 -0.0456 -0.2079 0.1002 0.0905 0.0906 0.0948 0.0859 0.0968 0.0881 0.0758 0.0947 0.1018 0.0872 0.0790 0.0862 0.0905 0.0425 0.0935 0.0874 0.0901 0.1173 0.0966 0.0952 0.0744 0.1253 0.0694 0.0897 0.0887
va: 2.0718 2.1410 2.1478 3.7280 3.7763 3.8467 3.9195 3.9076 3.9063 4.2172 3.7636 3.7912 3.9418 3.9312 3.9380 3.6788 3.5737 4.0899 3.9446 3.9762 3.8388 3.9578 1.0253 1.0297 1.0003 1.0054 1.0050 1.0016 1.0050 1.0159 1.0090 1.0297 0.9983 1.0097 0.9991 1.0018 1.0257 1.0026 1.0281 1.0266 1.0096 0.9958 1.0112 1.0281 1.0352 1.0112 0.9974 0.9974
dispcorr: -0.023112848 hartree
energy: -965.433895189292
dipole: 14.60831 -13.66646 0.94185 -1.77476 1.78757 0.01281 11.86015 -11.07820 0.78195
magnitude: 1.22421 au
magnitude: 3.11170 debye
