program: Orca
programVersion: 5.0.2
elementType: O O O C C C C C C C C C C C C C C C C C C C H H H H H H H H H H H H H H H H H H H H H H H H H H
charge: 0
multiplicity: 1
keywords: wb97x-d3
keywords: def2-TZVPP
keywords: def2/J RIJCOSX
keywords: DEFGRID2
keywords: scfconv7
keywords: smallprint printgap noloewdin
keywords: NOSOSCF
formula: C19H26O3
InChI: InChI=1/C19H26O3/c1-7-8-13-12(4)16(10-15(13)20)22-18(21)17-14(9-11(2)3)19(17,5)6/h7-9,14,16-17H,10H2,1-6H3
48 atoms
O  -0.065225 -0.36232 0.078019
O  0.953307 0.469937 -1.740488
O  -4.19087 -2.439414 0.342059
C  2.768675 1.780382 0.483021
C  3.483063 0.660298 -0.192159
C  2.091357 0.423559 0.361504
C  3.168957 2.170643 1.885678
C  2.29915 2.949975 -0.347873
C  4.656921 -0.018454 0.412204
C  0.96609 0.198987 -0.567439
C  5.047378 -1.262753 0.132781
C  -1.249131 -0.689153 -0.651737
C  6.267567 -1.858548 0.76544
C  4.318754 -2.158269 -0.821301
C  -1.865645 -1.965205 -0.10579
C  -2.313832 0.361423 -0.462888
C  -3.495735 -0.167922 -0.082702
C  -3.333111 -1.632562 0.089901
C  -1.992689 1.784617 -0.742441
C  -4.736083 0.562188 0.117476
C  -5.910693 0.052598 0.498276
C  -7.143478 0.870073 0.678723
H  3.500686 0.737038 -1.276417
H  2.028791 -0.137607 1.286745
H  2.339105 2.661391 2.396883
H  3.466421 1.31434 2.49082
H  4.005714 2.872113 1.867349
H  2.068455 2.675123 -1.374173
H  1.408876 3.409605 0.087323
H  3.078581 3.713499 -0.376953
H  5.252956 0.561114 1.110948
H  -1.005839 -0.778106 -1.714406
H  6.743732 -1.172325 1.464681
H  6.021427 -2.774963 1.307519
H  7.007276 -2.133875 0.00957
H  3.439126 -1.691578 -1.260251
H  4.975424 -2.467959 -1.638336
H  3.996971 -3.075023 -0.320324
H  -1.431324 -2.221594 0.863154
H  -1.743306 -2.830912 -0.756595
H  -2.866763 2.429982 -0.699126
H  -1.533986 1.890451 -1.726812
H  -1.267605 2.164309 -0.018374
H  -4.688142 1.631717 -0.065726
H  -6.000649 -1.008628 0.689777
H  -6.975889 1.924819 0.460168
H  -7.945833 0.513292 0.029061
H  -7.518167 0.792083 1.701838
totalener: -965.41428948 hartree
nucrepener: 1775.81345307 hartree
electener: -2741.22774255 hartree
oneelecener: -4837.78326581 hartree
twoeener: 2096.55552326 hartree
kineticenergy: 961.03438872 hartree
xcener: -95.143376716849 hartree
chargesum: -0.0000000
charge: -0.272617 -0.389083 -0.343835 0.139164 -0.047939 -0.076860 -0.280146 -0.262248 -0.226983 0.306209 -0.002828 0.220410 -0.210436 -0.229361 -0.136280 -0.051493 -0.009893 0.224794 -0.244862 -0.206957 -0.046771 -0.207664 0.106870 0.081746 0.091355 0.083435 0.093798 0.103414 0.078632 0.089273 0.094492 0.099833 0.078329 0.084899 0.087139 0.078562 0.090519 0.086180 0.088516 0.085530 0.094600 0.115334 0.094485 0.075383 0.125528 0.069350 0.089730 0.088749
qa: -0.2726 -0.3891 -0.3438 0.1392 -0.0479 -0.0769 -0.2801 -0.2622 -0.2270 0.3062 -0.0028 0.2204 -0.2104 -0.2294 -0.1363 -0.0515 -0.0099 0.2248 -0.2449 -0.2070 -0.0468 -0.2077 0.1069 0.0817 0.0914 0.0834 0.0938 0.1034 0.0786 0.0893 0.0945 0.0998 0.0783 0.0849 0.0871 0.0786 0.0905 0.0862 0.0885 0.0855 0.0946 0.1153 0.0945 0.0754 0.1255 0.0693 0.0897 0.0887
va: 2.1203 2.1026 2.1455 3.7371 3.8545 3.8149 3.9121 3.8911 3.8906 4.2251 3.7311 3.7997 3.9413 3.9456 3.9394 3.7039 3.5734 4.0773 3.9407 3.9757 3.8390 3.9577 1.0236 1.0347 1.0061 1.0047 1.0000 1.0178 1.0040 1.0047 1.0088 1.0268 1.0100 0.9991 0.9984 1.0190 1.0013 1.0005 1.0296 1.0289 1.0132 1.0070 1.0014 1.0282 1.0349 1.0112 0.9973 0.9974
dispcorr: -0.021908962 hartree
energy: -965.436198443168
dipole: 15.29527 -14.42433 0.87094 8.68798 -7.89370 0.79429 4.16766 -3.82699 0.34066
magnitude: 1.22698 au
magnitude: 3.11874 debye
