program: Orca
programVersion: 5.0.2
elementType: O O O C C C C C C C C C C C C C C C C C C C H H H H H H H H H H H H H H H H H H H H H H H H H H
charge: 0
multiplicity: 1
keywords: wb97x-d3
keywords: def2-TZVPP
keywords: def2/J RIJCOSX
keywords: DEFGRID2
keywords: scfconv7
keywords: smallprint printgap noloewdin
keywords: NOSOSCF
formula: C19H26O3
InChI: InChI=1/C19H26O3/c1-7-8-13-12(4)16(10-15(13)20)22-18(21)17-14(9-11(2)3)19(17,5)6/h7-9,14,16-17H,10H2,1-6H3
48 atoms
O  0.009355 -0.781986 -0.644773
O  0.714744 -2.872051 -0.991336
O  -4.097962 -1.36531 1.289258
C  2.583729 -0.65762 1.09619
C  2.653041 0.199095 -0.133548
C  2.287863 -1.255325 -0.270018
C  3.872671 -1.105928 1.740846
C  1.47707 -0.42079 2.095095
C  3.938721 0.6894 -0.694718
C  0.947082 -1.737069 -0.672927
C  4.609593 1.746776 -0.236488
C  -1.327985 -1.167916 -0.960329
C  5.885911 2.201507 -0.875858
C  4.152066 2.561355 0.935097
C  -2.033779 -1.912904 0.162456
C  -2.116251 0.099051 -1.148101
C  -3.206815 0.154553 -0.357312
C  -3.251966 -1.067665 0.485901
C  -1.644633 1.093536 -2.146713
C  -4.188318 1.224898 -0.328903
C  -5.250276 1.31497 0.476142
C  -6.212315 2.451792 0.44198
H  1.817928 0.88497 -0.244801
H  3.065483 -1.91613 -0.638686
H  4.247885 -0.336516 2.418726
H  3.714459 -2.015194 2.323053
H  4.656111 -1.304654 1.011262
H  0.580001 0.002718 1.649554
H  1.200342 -1.348209 2.600616
H  1.819116 0.275948 2.862907
H  4.338189 0.153821 -1.550954
H  -1.320849 -1.751034 -1.887157
H  6.711386 2.184187 -0.159969
H  6.164719 1.578526 -1.724776
H  5.802852 3.232186 -1.229509
H  3.238718 2.178558 1.386415
H  4.921756 2.590177 1.710299
H  3.971767 3.598484 0.641057
H  -1.409443 -2.00385 1.053514
H  -2.330272 -2.923652 -0.116932
H  -1.460685 0.613157 -3.11003
H  -0.695833 1.532539 -1.832974
H  -2.351054 1.904321 -2.306102
H  -4.027059 2.03072 -1.039369
H  -5.447456 0.534775 1.199395
H  -7.223614 2.10019 0.226359
H  -6.260275 2.952216 1.411548
H  -5.945561 3.195477 -0.308987
totalener: -965.41139884 hartree
nucrepener: 1799.14025789 hartree
electener: -2764.55165673 hartree
oneelecener: -4884.29909129 hartree
twoeener: 2119.74743456 hartree
kineticenergy: 961.05563876 hartree
xcener: -95.145421815032 hartree
chargesum: -0.0000000
charge: -0.280890 -0.354060 -0.342578 0.096371 -0.002979 -0.087288 -0.249219 -0.293710 -0.221161 0.309759 -0.017159 0.190692 -0.210358 -0.244955 -0.139839 -0.064181 0.001361 0.243128 -0.245124 -0.207274 -0.042436 -0.207342 0.102849 0.085712 0.084303 0.099543 0.083938 0.087541 0.103592 0.086713 0.093135 0.096464 0.085497 0.080091 0.085590 0.081865 0.088819 0.097998 0.084336 0.099878 0.096411 0.103924 0.092183 0.074621 0.126325 0.089978 0.088749 0.069186
qa: -0.2809 -0.3541 -0.3426 0.0964 -0.0030 -0.0873 -0.2492 -0.2937 -0.2212 0.3098 -0.0172 0.1907 -0.2104 -0.2450 -0.1398 -0.0642 0.0014 0.2431 -0.2451 -0.2073 -0.0424 -0.2073 0.1028 0.0857 0.0843 0.0995 0.0839 0.0875 0.1036 0.0867 0.0931 0.0965 0.0855 0.0801 0.0856 0.0819 0.0888 0.0980 0.0843 0.0999 0.0964 0.1039 0.0922 0.0746 0.1263 0.0900 0.0887 0.0692
va: 2.0787 2.1536 2.1481 3.6818 3.7907 3.8771 3.9133 3.9079 3.8599 4.2874 3.7357 3.8107 3.9410 3.9391 3.9396 3.7100 3.5877 4.0503 3.9641 3.9713 3.8363 3.9579 1.0108 1.0310 1.0016 1.0051 1.0073 1.0170 0.9995 1.0070 1.0142 1.0177 0.9988 1.0105 0.9984 1.0096 0.9996 1.0031 1.0287 1.0269 1.0019 1.0006 1.0117 1.0268 1.0351 0.9976 0.9975 1.0112
dispcorr: -0.023007113 hartree
energy: -965.434405949447
dipole: 16.46132 -15.52645 0.93487 17.50585 -15.98049 1.52536 4.54498 -4.93928 -0.39430
magnitude: 1.83198 au
magnitude: 4.65653 debye
