program: Orca
programVersion: 5.0.2
elementType: O O O C C C C C C C C C C C C C C C C C C C H H H H H H H H H H H H H H H H H H H H H H H H H H
charge: 0
multiplicity: 1
keywords: wb97x-d3
keywords: def2-TZVPP
keywords: def2/J RIJCOSX
keywords: DEFGRID2
keywords: scfconv7
keywords: smallprint printgap noloewdin
keywords: NOSOSCF
formula: C19H26O3
InChI: InChI=1/C19H26O3/c1-7-8-13-12(4)16(10-15(13)20)22-18(21)17-14(9-11(2)3)19(17,5)6/h7-9,14,16-17H,10H2,1-6H3
48 atoms
O  -0.216795 0.443781 -0.30706
O  1.11384 0.202584 -2.08755
O  -3.649317 -2.57148 -1.160292
C  3.089852 1.819476 -0.219302
C  3.486654 0.385677 -0.303049
C  2.055406 0.736048 0.048241
C  3.500649 2.623312 0.991775
C  3.033407 2.637949 -1.486363
C  4.378423 -0.248533 0.701591
C  0.977215 0.434886 -0.91473
C  4.316515 -1.523402 1.088267
C  -1.360481 0.163066 -1.112607
C  5.287571 -2.08359 2.082932
C  3.298947 -2.492458 0.568407
C  -1.579807 -1.318791 -1.388476
C  -2.572599 0.608243 -0.338909
C  -3.496484 -0.364473 -0.245585
C  -3.012073 -1.571861 -0.9557
C  -2.650869 2.006675 0.155242
C  -4.818747 -0.351957 0.360637
C  -5.173141 0.330898 1.45016
C  -6.538749 0.313991 2.047997
H  3.596446 0.012054 -1.318581
H  1.770396 0.624004 1.08814
H  2.814567 3.457455 1.146694
H  3.509383 2.028456 1.90495
H  4.500928 3.040091 0.857437
H  2.758923 2.049374 -2.358216
H  2.317301 3.456504 -1.391339
H  4.012499 3.079963 -1.679779
H  5.1615 0.377384 1.120152
H  -1.2888 0.729916 -2.047096
H  4.768136 -2.486181 2.956082
H  5.857282 -2.910546 1.651926
H  5.996982 -1.33355 2.430217
H  3.789253 -3.353526 0.107631
H  2.685817 -2.886442 1.382986
H  2.633709 -2.055724 -0.173204
H  -0.914765 -1.938868 -0.782591
H  -1.42045 -1.598085 -2.429146
H  -2.148333 2.110563 1.119303
H  -3.683642 2.329223 0.281523
H  -2.153427 2.69229 -0.532355
H  -5.549838 -1.000066 -0.113506
H  -4.431042 0.925899 1.97327
H  -7.221309 -0.317873 1.481132
H  -6.513006 -0.05292 3.07613
H  -6.963581 1.319478 2.086844
totalener: -965.41298408 hartree
nucrepener: 1779.95499416 hartree
electener: -2745.36797824 hartree
oneelecener: -4846.03235525 hartree
twoeener: 2100.66437701 hartree
kineticenergy: 961.05013693 hartree
xcener: -95.142434887339 hartree
chargesum: -0.0000000
charge: -0.275591 -0.383844 -0.323658 0.126235 -0.028503 -0.089337 -0.277715 -0.257449 -0.234733 0.307944 -0.007279 0.210052 -0.210225 -0.223546 -0.144281 -0.044588 -0.002133 0.218778 -0.309368 -0.151858 -0.086194 -0.202406 0.108089 0.083444 0.090645 0.085530 0.092519 0.102269 0.083869 0.086750 0.094325 0.089680 0.084864 0.087889 0.078353 0.091390 0.087864 0.077784 0.083540 0.099262 0.114232 0.110370 0.096954 0.099313 0.106994 0.079758 0.089486 0.084527
qa: -0.2756 -0.3838 -0.3237 0.1262 -0.0285 -0.0893 -0.2777 -0.2574 -0.2347 0.3079 -0.0073 0.2101 -0.2102 -0.2235 -0.1443 -0.0446 -0.0021 0.2188 -0.3094 -0.1519 -0.0862 -0.2024 0.1081 0.0834 0.0906 0.0855 0.0925 0.1023 0.0839 0.0867 0.0943 0.0897 0.0849 0.0879 0.0784 0.0914 0.0879 0.0778 0.0835 0.0993 0.1142 0.1104 0.0970 0.0993 0.1070 0.0798 0.0895 0.0845
va: 2.1131 2.1172 2.1749 3.7394 3.8360 3.8212 3.9123 3.8973 3.8963 4.2088 3.7360 3.8151 3.9412 3.9434 3.8921 3.6557 3.5544 4.1117 3.9640 3.8951 3.8652 3.9568 1.0257 1.0329 1.0064 1.0044 1.0010 1.0201 1.0020 1.0029 1.0092 1.0182 0.9992 0.9986 1.0098 1.0023 1.0006 1.0181 1.0277 1.0295 0.9933 1.0013 1.0080 1.0323 1.0034 1.0116 0.9973 0.9989
dispcorr: -0.021783147 hartree
energy: -965.434767225458
dipole: 13.25674 -12.74612 0.51062 7.52701 -6.19495 1.33206 12.22964 -11.10561 1.12403
magnitude: 1.81619 au
magnitude: 4.61639 debye
