program: Orca
programVersion: 5.0.2
elementType: O O O C C C C C C C C C C C C C C C C C C C H H H H H H H H H H H H H H H H H H H H H H H H H H
charge: 0
multiplicity: 1
keywords: wb97x-d3
keywords: def2-TZVPP
keywords: def2/J RIJCOSX
keywords: DEFGRID2
keywords: scfconv7
keywords: smallprint printgap noloewdin
keywords: NOSOSCF
formula: C19H26O3
InChI: InChI=1/C19H26O3/c1-7-8-13-12(4)16(10-15(13)20)22-18(21)17-14(9-11(2)3)19(17,5)6/h7-9,14,16-17H,10H2,1-6H3
48 atoms
O  -0.082142 -0.386556 0.096765
O  0.958147 0.425069 -1.71799
O  -4.223242 -2.431691 0.331485
C  2.745344 1.762297 0.51152
C  3.466198 0.642519 -0.156932
C  2.073956 0.401738 0.395631
C  3.143382 2.164978 1.911207
C  2.272593 2.924559 -0.327843
C  4.644135 -0.028748 0.445457
C  0.95812 0.165454 -0.541897
C  5.092193 -1.236463 0.099297
C  -1.259382 -0.709376 -0.646725
C  6.319412 -1.822731 0.727651
C  4.425128 -2.097917 -0.928877
C  -1.891293 -1.979781 -0.105544
C  -2.318158 0.349655 -0.473202
C  -3.506011 -0.168308 -0.096561
C  -3.356921 -1.63337 0.081864
C  -1.984819 1.768408 -0.761448
C  -4.739759 0.573879 0.098072
C  -5.91924 0.078513 0.482162
C  -7.141347 0.912304 0.660754
H  3.482047 0.713738 -1.241203
H  2.008539 -0.155397 1.323068
H  3.427959 1.31396 2.529592
H  3.987939 2.856736 1.887756
H  2.316942 2.671539 2.412115
H  3.056236 3.682493 -0.378274
H  2.025513 2.637873 -1.347058
H  1.391501 3.394996 0.114383
H  5.194841 0.524762 1.199999
H  -1.002944 -0.80298 -1.705732
H  6.756933 -1.158071 1.471524
H  6.095678 -2.774474 1.215899
H  7.083317 -2.032061 -0.025364
H  4.143527 -3.06217 -0.498374
H  3.528098 -1.647806 -1.349533
H  5.108463 -2.316276 -1.753308
H  -1.464776 -2.244289 0.864491
H  -1.774728 -2.84438 -0.758918
H  -2.854392 2.420279 -0.730914
H  -1.517695 1.862301 -1.74291
H  -1.262885 2.149573 -0.035188
H  -4.681262 1.642016 -0.090021
H  -6.021834 -0.980808 0.677253
H  -7.519739 0.83711 1.682545
H  -6.957298 1.96487 0.445842
H  -7.946872 0.569528 0.007671
totalener: -965.41438527 hartree
nucrepener: 1774.64115928 hartree
electener: -2740.05554455 hartree
oneelecener: -4835.43987585 hartree
twoeener: 2095.38433130 hartree
kineticenergy: 961.03809558 hartree
xcener: -95.144268379921 hartree
chargesum: 0.0000000
charge: -0.272893 -0.390842 -0.343581 0.140755 -0.053034 -0.065670 -0.281750 -0.263980 -0.221108 0.304293 -0.003130 0.220476 -0.211704 -0.232036 -0.135893 -0.051235 -0.009508 0.223604 -0.245771 -0.206675 -0.046370 -0.207478 0.105300 0.080785 0.081691 0.095374 0.091325 0.090155 0.103745 0.078669 0.094611 0.099970 0.077934 0.085496 0.086619 0.085667 0.078644 0.090300 0.088658 0.085636 0.094767 0.115230 0.094620 0.075165 0.125580 0.088601 0.069238 0.089753
qa: -0.2729 -0.3908 -0.3436 0.1408 -0.0530 -0.0657 -0.2818 -0.2640 -0.2211 0.3043 -0.0031 0.2205 -0.2117 -0.2320 -0.1359 -0.0512 -0.0095 0.2236 -0.2458 -0.2067 -0.0464 -0.2075 0.1053 0.0808 0.0817 0.0954 0.0913 0.0902 0.1037 0.0787 0.0946 0.1000 0.0779 0.0855 0.0866 0.0857 0.0786 0.0903 0.0887 0.0856 0.0948 0.1152 0.0946 0.0752 0.1256 0.0886 0.0692 0.0898
va: 2.1227 2.0991 2.1459 3.7448 3.8558 3.8154 3.9130 3.8888 3.8913 4.2282 3.7340 3.7990 3.9414 3.9469 3.9382 3.7024 3.5719 4.0786 3.9407 3.9754 3.8393 3.9577 1.0236 1.0349 1.0049 0.9994 1.0062 1.0048 1.0177 1.0040 1.0091 1.0273 1.0103 0.9987 0.9983 1.0003 1.0195 1.0009 1.0297 1.0289 1.0132 1.0070 1.0012 1.0283 1.0347 0.9974 1.0112 0.9973
dispcorr: -0.021839048 hartree
energy: -965.436224318417
dipole: 15.56762 -14.69116 0.87646 8.95342 -8.14493 0.80849 3.89132 -3.56130 0.33002
magnitude: 1.23724 au
magnitude: 3.14480 debye
