program: Orca
programVersion: 5.0.2
elementType: O O O C C C C C C C C C C C C C C C C C C C H H H H H H H H H H H H H H H H H H H H H H H H H H
charge: 0
multiplicity: 1
keywords: wb97x-d3
keywords: def2-TZVPP
keywords: def2/J RIJCOSX
keywords: DEFGRID2
keywords: scfconv7
keywords: smallprint printgap noloewdin
keywords: NOSOSCF
formula: C19H26O3
InChI: InChI=1/C19H26O3/c1-7-8-13-12(4)16(10-15(13)20)22-18(21)17-14(9-11(2)3)19(17,5)6/h7-9,14,16-17H,10H2,1-6H3
48 atoms
O  -0.105331 -0.376359 0.11424
O  0.954435 0.422419 -1.695357
O  -4.236405 -2.431642 0.349014
C  2.753562 1.756623 0.518102
C  3.453778 0.599718 -0.110197
C  2.046234 0.413812 0.431014
C  3.138325 2.193627 1.911553
C  2.325799 2.907915 -0.359951
C  4.597001 -0.097802 0.521709
C  0.940776 0.172204 -0.517376
C  5.150963 -1.226006 0.073648
C  -1.274261 -0.709293 -0.637892
C  6.329552 -1.840225 0.766094
C  4.661974 -1.973082 -1.130006
C  -1.905733 -1.978178 -0.092221
C  -2.337925 0.34718 -0.480069
C  -3.525207 -0.170676 -0.101582
C  -3.372188 -1.633614 0.091314
C  -2.008557 1.764105 -0.781805
C  -4.761365 0.569913 0.083593
C  -5.940198 0.074861 0.469942
C  -7.165042 0.906163 0.640008
H  3.482873 0.644115 -1.194759
H  1.955867 -0.1167 1.371832
H  2.322722 2.752467 2.37305
H  3.371154 1.357364 2.570097
H  4.011571 2.84826 1.881963
H  2.092294 2.603017 -1.376834
H  1.446857 3.407673 0.053078
H  3.127544 3.646618 -0.410666
H  5.024846 0.358653 1.408888
H  -1.007992 -0.809342 -1.693886
H  6.641159 -1.263758 1.636232
H  6.103711 -2.856272 1.098768
H  7.185818 -1.917453 0.091576
H  3.786086 -1.523258 -1.5929
H  5.445423 -2.042123 -1.8889
H  4.401235 -2.999948 -0.862457
H  -1.47998 -2.238935 0.87912
H  -1.787241 -2.845085 -0.742196
H  -2.881292 2.412236 -0.76506
H  -1.534737 1.849087 -1.760847
H  -1.29368 2.156831 -0.054708
H  -4.705232 1.636524 -0.113669
H  -6.039697 -0.982817 0.675167
H  -7.968757 0.554596 -0.010587
H  -7.543997 0.838692 1.662115
H  -6.984841 1.95739 0.41593
totalener: -965.41452341 hartree
nucrepener: 1770.12709607 hartree
electener: -2735.54161948 hartree
oneelecener: -4826.41377915 hartree
twoeener: 2090.87215967 hartree
kineticenergy: 961.03864576 hartree
xcener: -95.144674442350 hartree
chargesum: -0.0000000
charge: -0.274073 -0.393212 -0.343656 0.129926 -0.058411 -0.043016 -0.281294 -0.260053 -0.198896 0.302745 -0.011612 0.222011 -0.214665 -0.236690 -0.136687 -0.052672 -0.009867 0.223924 -0.245117 -0.207226 -0.045827 -0.207541 0.101954 0.079555 0.092039 0.075970 0.098822 0.103897 0.078454 0.089824 0.092338 0.099920 0.077208 0.085192 0.086220 0.079697 0.088453 0.084576 0.088956 0.085774 0.094571 0.115125 0.094907 0.075214 0.125619 0.089759 0.088610 0.069254
qa: -0.2741 -0.3932 -0.3437 0.1299 -0.0584 -0.0430 -0.2813 -0.2601 -0.1989 0.3027 -0.0116 0.2220 -0.2147 -0.2367 -0.1367 -0.0527 -0.0099 0.2239 -0.2451 -0.2072 -0.0458 -0.2075 0.1020 0.0796 0.0920 0.0760 0.0988 0.1039 0.0785 0.0898 0.0923 0.0999 0.0772 0.0852 0.0862 0.0797 0.0885 0.0846 0.0890 0.0858 0.0946 0.1151 0.0949 0.0752 0.1256 0.0898 0.0886 0.0693
va: 2.1228 2.0976 2.1459 3.7825 3.8544 3.8201 3.9152 3.8882 3.8982 4.2329 3.7482 3.7983 3.9431 3.9496 3.9389 3.7059 3.5719 4.0775 3.9409 3.9767 3.8394 3.9578 1.0216 1.0349 1.0056 1.0062 0.9990 1.0183 1.0043 1.0041 1.0112 1.0273 1.0108 0.9984 0.9979 1.0188 0.9999 0.9999 1.0298 1.0288 1.0129 1.0071 1.0013 1.0282 1.0347 0.9973 0.9974 1.0112
dispcorr: -0.021548425 hartree
energy: -965.436071837501
dipole: 16.02447 -15.15298 0.87149 9.10979 -8.28740 0.82239 3.44427 -3.13719 0.30708
magnitude: 1.23698 au
magnitude: 3.14415 debye
