program: Orca
programVersion: 5.0.2
elementType: O O O C C C C C C C C C C C C C C C C C C C H H H H H H H H H H H H H H H H H H H H H H H H H H
charge: 0
multiplicity: 1
keywords: wb97x-d3
keywords: def2-TZVPP
keywords: def2/J RIJCOSX
keywords: DEFGRID2
keywords: scfconv7
keywords: smallprint printgap noloewdin
keywords: NOSOSCF
formula: C19H26O3
InChI: InChI=1/C19H26O3/c1-7-8-13-12(4)16(10-15(13)20)22-18(21)17-14(9-11(2)3)19(17,5)6/h7-9,14,16-17H,10H2,1-6H3
48 atoms
O  -0.058973 -0.368438 0.070009
O  0.938382 0.488412 -1.748112
O  -4.181858 -2.45609 0.332722
C  2.779917 1.779907 0.463123
C  3.481935 0.666935 -0.235006
C  2.100413 0.423708 0.338792
C  3.210292 2.15342 1.861674
C  2.298134 2.960475 -0.344259
C  4.667117 -0.013782 0.34591
C  0.963788 0.204162 -0.57823
C  4.989266 -1.292201 0.144887
C  -1.246165 -0.693234 -0.656628
C  6.2167 -1.895093 0.756066
C  4.168385 -2.223649 -0.692457
C  -1.858264 -1.974701 -0.118273
C  -2.312421 0.35359 -0.457585
C  -3.492329 -0.181126 -0.07883
C  -3.326253 -1.646078 0.083654
C  -1.995835 1.779296 -0.728972
C  -4.733366 0.545526 0.128654
C  -5.905308 0.033964 0.514533
C  -7.137172 0.85077 0.703237
H  3.481934 0.753609 -1.318923
H  2.052632 -0.146049 1.259803
H  2.390793 2.632769 2.399257
H  3.528508 1.290533 2.446336
H  4.042542 2.859752 1.83195
H  2.029608 2.696064 -1.364236
H  1.429522 3.428712 0.124248
H  3.086423 3.714055 -0.394512
H  5.32908 0.593696 0.956328
H  -1.006627 -0.774482 -1.720716
H  5.958168 -2.740095 1.399302
H  6.889247 -2.283765 -0.012521
H  6.773006 -1.175382 1.355454
H  4.773007 -2.650316 -1.496315
H  3.809369 -3.066272 -0.095955
H  3.30533 -1.74253 -1.147306
H  -1.420706 -2.239048 0.846938
H  -1.737129 -2.834358 -0.777241
H  -1.549041 1.893478 -1.717722
H  -1.262804 2.154103 -0.010696
H  -2.869848 2.423181 -0.670121
H  -4.688279 1.615343 -0.053164
H  -5.994199 -1.02768 0.703662
H  -7.94187 0.498595 0.054113
H  -7.508257 0.766981 1.727041
H  -6.969589 1.906498 0.490531
totalener: -965.41427037 hartree
nucrepener: 1778.15926050 hartree
electener: -2743.57353087 hartree
oneelecener: -4842.47285997 hartree
twoeener: 2098.89932909 hartree
kineticenergy: 961.03889436 hartree
xcener: -95.144351859378 hartree
chargesum: -0.0000000
charge: -0.272732 -0.388915 -0.343675 0.137597 -0.035782 -0.091782 -0.276933 -0.265593 -0.235644 0.309324 -0.002567 0.220499 -0.209615 -0.228099 -0.135149 -0.052519 -0.010197 0.224141 -0.243482 -0.206296 -0.046794 -0.207452 0.108461 0.083868 0.091079 0.085665 0.092282 0.103610 0.078944 0.089333 0.093795 0.099631 0.085034 0.087184 0.078575 0.091230 0.087302 0.079232 0.088358 0.085514 0.115435 0.094317 0.094542 0.075300 0.125268 0.089745 0.088678 0.069281
qa: -0.2727 -0.3889 -0.3437 0.1376 -0.0358 -0.0918 -0.2769 -0.2656 -0.2356 0.3093 -0.0026 0.2205 -0.2096 -0.2281 -0.1351 -0.0525 -0.0102 0.2241 -0.2435 -0.2063 -0.0468 -0.2075 0.1085 0.0839 0.0911 0.0857 0.0923 0.1036 0.0789 0.0893 0.0938 0.0996 0.0850 0.0872 0.0786 0.0912 0.0873 0.0792 0.0884 0.0855 0.1154 0.0943 0.0945 0.0753 0.1253 0.0897 0.0887 0.0693
va: 2.1206 2.1024 2.1458 3.7300 3.8415 3.8227 3.9096 3.8940 3.8955 4.2185 3.7313 3.7998 3.9413 3.9439 3.9372 3.7065 3.5726 4.0785 3.9415 3.9750 3.8393 3.9577 1.0245 1.0334 1.0064 1.0046 1.0006 1.0178 1.0037 1.0048 1.0093 1.0269 0.9989 0.9989 1.0097 1.0019 1.0005 1.0186 1.0296 1.0289 1.0069 1.0015 1.0132 1.0283 1.0348 0.9973 0.9974 1.0113
dispcorr: -0.022025206 hartree
energy: -965.436295577411
dipole: 15.08455 -14.21423 0.87032 8.53042 -7.75039 0.78002 4.43742 -4.08329 0.35413
magnitude: 1.22119 au
magnitude: 3.10402 debye
