program: Orca
programVersion: 5.0.2
elementType: O O O C C C C C C C C C C C C C C C C C C C H H H H H H H H H H H H H H H H H H H H H H H H H H
charge: 0
multiplicity: 1
keywords: wb97x-d3
keywords: def2-TZVPP
keywords: def2/J RIJCOSX
keywords: DEFGRID2
keywords: scfconv7
keywords: smallprint printgap noloewdin
keywords: NOSOSCF
formula: C19H26O3
InChI: InChI=1/C19H26O3/c1-7-8-13-12(4)16(10-15(13)20)22-18(21)17-14(9-11(2)3)19(17,5)6/h7-9,14,16-17H,10H2,1-6H3
48 atoms
O  -0.309374 -0.658499 0.076214
O  0.795296 0.130924 -1.710555
O  -4.442064 -2.665181 0.349251
C  2.523274 1.482705 0.545947
C  3.250584 0.318646 -0.055432
C  1.83243 0.134206 0.443395
C  2.87349 1.941781 1.94132
C  2.119031 2.62113 -0.359446
C  4.355252 -0.379455 0.627624
C  0.751113 -0.114728 -0.532994
C  5.514234 -0.764412 0.08808
C  -1.461302 -1.003156 -0.69982
C  6.538849 -1.488862 0.909636
C  5.912613 -0.534593 -1.338254
C  -2.098525 -2.270656 -0.14978
C  -2.522896 0.062168 -0.570094
C  -3.688104 -0.441561 -0.12373
C  -3.553413 -1.90272 0.072724
C  -2.225028 1.4595 -0.976685
C  -4.965446 0.214534 0.112406
C  -5.129515 1.448308 0.590852
C  -6.453301 2.0895 0.833804
H  3.317951 0.360064 -1.136712
H  1.712081 -0.389302 1.385522
H  3.750312 2.591039 1.919573
H  2.048262 2.510254 2.373539
H  3.092023 1.119164 2.620547
H  1.93266 2.306375 -1.383113
H  1.216428 3.112097 0.011493
H  2.912737 3.369942 -0.380679
H  4.195218 -0.611593 1.676433
H  -1.171457 -1.113221 -1.748151
H  6.762062 -2.469654 0.482078
H  7.483233 -0.939444 0.936192
H  6.210933 -1.6402 1.937404
H  5.169986 0.005221 -1.920631
H  6.844777 0.033355 -1.38783
H  6.10279 -1.484946 -1.842911
H  -1.651261 -2.556132 0.804517
H  -2.010133 -3.127782 -0.817572
H  -1.690758 1.994013 -0.186691
H  -3.136998 2.01531 -1.190055
H  -1.583669 1.480272 -1.857659
H  -5.843106 -0.39483 -0.082425
H  -4.256791 2.037029 0.856383
H  -7.27769 1.430431 0.564589
H  -6.569516 2.364909 1.88395
H  -6.556069 3.010938 0.256613
totalener: -965.41349375 hartree
nucrepener: 1764.24613428 hartree
electener: -2729.65962802 hartree
oneelecener: -4814.54120463 hartree
twoeener: 2084.88157661 hartree
kineticenergy: 961.04568161 hartree
xcener: -95.143836756516 hartree
chargesum: -0.0000000
charge: -0.271366 -0.392920 -0.324334 0.086947 0.042106 -0.085903 -0.245416 -0.262044 -0.189604 0.329792 -0.052161 0.206818 -0.202110 -0.236274 -0.132800 -0.044192 -0.017240 0.207468 -0.305645 -0.159438 -0.085238 -0.203868 0.091282 0.072444 0.093995 0.089734 0.071903 0.101904 0.077873 0.089811 0.071065 0.099889 0.085295 0.083892 0.076501 0.082809 0.085200 0.087909 0.089655 0.086606 0.106942 0.114864 0.118009 0.098587 0.106471 0.079883 0.089701 0.085198
qa: -0.2714 -0.3929 -0.3243 0.0869 0.0421 -0.0859 -0.2454 -0.2620 -0.1896 0.3298 -0.0522 0.2068 -0.2021 -0.2363 -0.1328 -0.0442 -0.0172 0.2075 -0.3056 -0.1594 -0.0852 -0.2039 0.0913 0.0724 0.0940 0.0897 0.0719 0.1019 0.0779 0.0898 0.0711 0.0999 0.0853 0.0839 0.0765 0.0828 0.0852 0.0879 0.0897 0.0866 0.1069 0.1149 0.1180 0.0986 0.1065 0.0799 0.0897 0.0852
va: 2.1215 2.1055 2.1748 3.7328 3.7886 3.8766 3.9147 3.9100 3.9045 4.2386 3.8315 3.7973 3.9343 3.9454 3.8791 3.6658 3.5378 4.1313 3.9288 3.9036 3.8664 3.9562 1.0343 1.0381 1.0037 1.0040 1.0112 1.0197 1.0042 1.0032 1.0219 1.0264 0.9982 0.9984 1.0123 1.0160 0.9993 0.9989 1.0314 1.0295 0.9926 1.0023 1.0162 1.0313 1.0037 1.0118 0.9972 0.9988
dispcorr: -0.021398741 hartree
energy: -965.434892488183
dipole: 19.58254 -18.55773 1.02482 14.15491 -13.01656 1.13836 3.55647 -3.28727 0.26919
magnitude: 1.55518 au
magnitude: 3.95294 debye
