program: Orca
programVersion: 5.0.2
elementType: O O O C C C C C C C C C C C C C C C C C C C H H H H H H H H H H H H H H H H H H H H H H H H H H
charge: 0
multiplicity: 1
keywords: wb97x-d3
keywords: def2-TZVPP
keywords: def2/J RIJCOSX
keywords: DEFGRID2
keywords: scfconv7
keywords: smallprint printgap noloewdin
keywords: NOSOSCF
formula: C19H26O3
InChI: InChI=1/C19H26O3/c1-7-8-13-12(4)16(10-15(13)20)22-18(21)17-14(9-11(2)3)19(17,5)6/h7-9,14,16-17H,10H2,1-6H3
48 atoms
O  -0.394955 -0.812978 0.000511
O  0.71194 -0.220552 -1.859705
O  -4.656294 -2.563141 0.369326
C  2.579104 1.141666 0.271635
C  3.217109 -0.090444 -0.292168
C  1.817792 -0.17616 0.257769
C  3.020663 1.622747 1.631745
C  2.194659 2.262809 -0.662332
C  4.325241 -0.801262 0.396499
C  0.686792 -0.394613 -0.66916
C  5.609184 -0.447933 0.327226
C  -1.596838 -1.091409 -0.724176
C  6.676884 -1.235399 1.023918
C  6.090004 0.74003 -0.448635
C  -2.294721 -2.31383 -0.146732
C  -2.578464 0.041377 -0.554257
C  -3.763122 -0.387857 -0.083217
C  -3.722287 -1.857141 0.092786
C  -2.191056 1.419074 -0.950788
C  -4.985628 0.35049 0.195138
C  -5.050186 1.578519 0.709943
C  -6.319209 2.303712 1.002412
H  3.254763 -0.114821 -1.378444
H  1.699167 -0.640659 1.231013
H  3.260766 0.803157 2.307527
H  3.915604 2.241922 1.543053
H  2.241633 2.228081 2.098531
H  1.948333 1.917287 -1.663348
H  1.337015 2.818122 -0.276051
H  3.024367 2.967602 -0.748109
H  4.061588 -1.680663 0.977095
H  -1.358322 -1.221167 -1.782991
H  7.40564 -1.627245 0.310001
H  7.233929 -0.6086 1.724664
H  6.267364 -2.078158 1.579376
H  6.646427 1.424916 0.196055
H  6.77893 0.432692 -1.239703
H  5.27977 1.300565 -0.91094
H  -1.850092 -2.60655 0.806873
H  -2.264219 -3.185352 -0.800649
H  -1.600715 1.900832 -0.166831
H  -3.065017 2.042389 -1.134337
H  -1.571102 1.40568 -1.847576
H  -5.908871 -0.188683 0.00434
H  -4.131806 2.095963 0.970504
H  -6.367877 3.248994 0.457655
H  -7.193606 1.71356 0.73109
H  -6.394146 2.550894 2.063314
totalener: -965.41250561 hartree
nucrepener: 1769.34302036 hartree
electener: -2734.75552597 hartree
oneelecener: -4824.74641571 hartree
twoeener: 2089.99088974 hartree
kineticenergy: 961.05094667 hartree
xcener: -95.143451235331 hartree
chargesum: 0.0000000
charge: -0.273582 -0.389829 -0.323847 0.080413 -0.032215 -0.092145 -0.242857 -0.274190 -0.189466 0.331031 -0.027427 0.207958 -0.210120 -0.238127 -0.134486 -0.041386 -0.014141 0.208816 -0.308979 -0.161169 -0.084848 -0.203915 0.111061 0.081113 0.083529 0.086798 0.094311 0.106750 0.082810 0.086155 0.090249 0.101163 0.087026 0.083939 0.079592 0.086481 0.098024 0.081170 0.088926 0.086661 0.108325 0.114649 0.116489 0.098646 0.106042 0.085156 0.079668 0.089777
qa: -0.2736 -0.3898 -0.3238 0.0804 -0.0322 -0.0921 -0.2429 -0.2742 -0.1895 0.3310 -0.0274 0.2080 -0.2101 -0.2381 -0.1345 -0.0414 -0.0141 0.2088 -0.3090 -0.1612 -0.0848 -0.2039 0.1111 0.0811 0.0835 0.0868 0.0943 0.1067 0.0828 0.0862 0.0902 0.1012 0.0870 0.0839 0.0796 0.0865 0.0980 0.0812 0.0889 0.0867 0.1083 0.1146 0.1165 0.0986 0.1060 0.0852 0.0797 0.0898
va: 2.1212 2.1095 2.1750 3.7148 3.8207 3.8711 3.9054 3.9021 3.8536 4.2499 3.7435 3.7933 3.9397 3.9365 3.8820 3.6552 3.5351 4.1299 3.9276 3.9036 3.8661 3.9564 1.0252 1.0350 1.0074 1.0023 1.0055 1.0184 1.0049 1.0046 1.0130 1.0280 0.9981 0.9991 1.0106 0.9997 1.0029 1.0112 1.0308 1.0299 0.9928 1.0030 1.0156 1.0312 1.0040 0.9988 1.0118 0.9972
dispcorr: -0.022510060 hartree
energy: -965.435015674520
dipole: 21.34361 -20.16299 1.18062 16.69560 -15.47132 1.22428 4.89530 -4.54102 0.35428
magnitude: 1.73731 au
magnitude: 4.41589 debye
