program: Orca
programVersion: 5.0.2
elementType: O O O C C C C C C C C C C C C C C C C C C C H H H H H H H H H H H H H H H H H H H H H H H H H H
charge: 0
multiplicity: 1
keywords: wb97x-d3
keywords: def2-TZVPP
keywords: def2/J RIJCOSX
keywords: DEFGRID2
keywords: scfconv7
keywords: smallprint printgap noloewdin
keywords: NOSOSCF
formula: C19H26O3
InChI: InChI=1/C19H26O3/c1-7-8-13-12(4)16(10-15(13)20)22-18(21)17-14(9-11(2)3)19(17,5)6/h7-9,14,16-17H,10H2,1-6H3
48 atoms
O  -0.320543 -0.734186 0.094652
O  0.769395 -0.197073 -1.790824
O  -4.694394 -2.178574 0.526189
C  2.71065 1.108891 0.316084
C  3.310811 -0.12655 -0.282377
C  1.924488 -0.19443 0.301413
C  3.200129 1.561946 1.669284
C  2.318331 2.251339 -0.588587
C  4.422176 -0.865893 0.371533
C  0.764957 -0.368424 -0.599783
C  5.714982 -0.572797 0.227334
C  -1.548487 -0.946836 -0.605443
C  6.783124 -1.38701 0.891732
C  6.207316 0.569856 -0.607204
C  -2.330852 -2.078296 0.037958
C  -2.449214 0.256222 -0.492233
C  -3.684114 -0.066554 -0.055272
C  -3.73207 -1.524046 0.21733
C  -1.938137 1.592653 -0.890772
C  -4.79856 0.849865 0.113058
C  -6.016742 0.550471 0.571265
C  -7.1083 1.553799 0.72003
H  3.323477 -0.136464 -1.369197
H  1.819287 -0.671828 1.270056
H  4.102523 2.167159 1.56209
H  2.446103 2.173272 2.168007
H  3.446713 0.728729 2.325834
H  2.031457 1.926809 -1.585822
H  1.485628 2.816908 -0.164348
H  3.157698 2.94179 -0.69191
H  4.150692 -1.714279 0.99315
H  -1.333337 -1.149511 -1.658311
H  7.457172 -1.828714 0.153656
H  7.401481 -0.765954 1.544442
H  6.3693 -2.196438 1.491692
H  6.837776 1.237139 -0.014586
H  6.828413 0.209506 -1.43113
H  5.400225 1.163837 -1.03167
H  -1.921773 -2.324384 1.020465
H  -2.344134 -2.996794 -0.548509
H  -1.154405 1.925747 -0.206147
H  -2.712708 2.355446 -0.895746
H  -1.48846 1.553058 -1.883812
H  -4.60453 1.882519 -0.162005
H  -6.251206 -0.46711 0.854465
H  -7.446255 1.611827 1.756979
H  -6.796607 2.551267 0.410649
H  -7.980825 1.2725 0.126653
totalener: -965.41426585 hartree
nucrepener: 1763.70464759 hartree
electener: -2729.11891344 hartree
oneelecener: -4813.55146683 hartree
twoeener: 2084.43255340 hartree
kineticenergy: 961.04477735 hartree
xcener: -95.145021058060 hartree
chargesum: 0.0000000
charge: -0.274211 -0.385814 -0.342469 0.092297 -0.032066 -0.090635 -0.241886 -0.283675 -0.188943 0.316554 -0.029661 0.219578 -0.210449 -0.234865 -0.136810 -0.049354 -0.010099 0.223371 -0.247710 -0.205659 -0.045361 -0.207436 0.110787 0.080165 0.087303 0.094422 0.083344 0.108267 0.081826 0.088449 0.090411 0.100813 0.087275 0.083321 0.079687 0.084890 0.097666 0.080505 0.088600 0.085834 0.094379 0.095185 0.115240 0.074403 0.124866 0.088594 0.069142 0.089930
qa: -0.2742 -0.3858 -0.3425 0.0923 -0.0321 -0.0906 -0.2419 -0.2837 -0.1889 0.3166 -0.0297 0.2196 -0.2104 -0.2349 -0.1368 -0.0494 -0.0101 0.2234 -0.2477 -0.2057 -0.0454 -0.2074 0.1108 0.0802 0.0873 0.0944 0.0833 0.1083 0.0818 0.0884 0.0904 0.1008 0.0873 0.0833 0.0797 0.0849 0.0977 0.0805 0.0886 0.0858 0.0944 0.0952 0.1152 0.0744 0.1249 0.0886 0.0691 0.0899
va: 2.1250 2.1102 2.1465 3.7026 3.8237 3.8762 3.9034 3.9016 3.8517 4.2629 3.7446 3.8008 3.9401 3.9372 3.9375 3.6930 3.5731 4.0798 3.9395 3.9774 3.8408 3.9576 1.0242 1.0352 1.0027 1.0053 1.0075 1.0168 1.0051 1.0055 1.0131 1.0268 0.9979 0.9993 1.0105 1.0003 1.0021 1.0115 1.0295 1.0290 1.0010 1.0134 1.0072 1.0285 1.0348 0.9974 1.0113 0.9973
dispcorr: -0.022280064 hartree
energy: -965.436545912714
dipole: 20.82541 -19.67684 1.14857 14.09601 -13.12845 0.96756 3.67548 -3.38498 0.29049
magnitude: 1.52963 au
magnitude: 3.88802 debye
