program: Orca
programVersion: 5.0.2
elementType: O O O C C C C C C C C C C C C C C C C C C C H H H H H H H H H H H H H H H H H H H H H H H H H H
charge: 0
multiplicity: 1
keywords: wb97x-d3
keywords: def2-TZVPP
keywords: def2/J RIJCOSX
keywords: DEFGRID2
keywords: scfconv7
keywords: smallprint printgap noloewdin
keywords: NOSOSCF
formula: C19H26O3
InChI: InChI=1/C19H26O3/c1-7-8-13-12(4)16(10-15(13)20)22-18(21)17-14(9-11(2)3)19(17,5)6/h7-9,14,16-17H,10H2,1-6H3
48 atoms
O  -0.12806 0.679823 -0.251945
O  1.071963 0.377796 -2.114128
O  -3.604438 -2.306478 -0.928159
C  3.316743 1.754112 -0.365964
C  3.535153 0.281061 -0.424523
C  2.172198 0.811309 -0.030707
C  3.869054 2.527389 0.807834
C  3.308477 2.541833 -1.653151
C  4.374063 -0.435271 0.570743
C  1.022948 0.60417 -0.933307
C  4.104967 -1.635861 1.086044
C  -1.332818 0.444596 -0.978403
C  5.027326 -2.284404 2.073562
C  2.885051 -2.431962 0.733697
C  -1.590622 -1.021799 -1.290981
C  -2.477172 0.861446 -0.096488
C  -3.41966 -0.096144 0.015125
C  -2.983576 -1.290238 -0.751143
C  -2.467975 2.221716 0.50072
C  -4.667562 0.014183 0.750392
C  -5.596006 -0.934753 0.898022
C  -6.853937 -0.737053 1.671793
H  3.564368 -0.12411 -1.43367
H  1.924279 0.753719 1.022982
H  4.907849 2.812166 0.628522
H  3.298921 3.444518 0.96449
H  3.837872 1.95519 1.735009
H  2.951456 1.961333 -2.500187
H  2.680806 3.430741 -1.564946
H  4.321478 2.877459 -1.882947
H  5.293021 0.059467 0.872928
H  -1.324949 1.048227 -1.892733
H  5.882316 -1.653227 2.312792
H  4.505559 -2.512319 3.006384
H  5.407596 -3.234433 1.690175
H  3.164495 -3.432547 0.395681
H  2.244506 -2.569376 1.608804
H  2.288899 -1.973904 -0.052254
H  -0.881491 -1.66998 -0.770379
H  -1.524655 -1.262282 -2.351137
H  -3.403619 2.47336 0.993921
H  -2.276352 2.977098 -0.264712
H  -1.665677 2.311923 1.235451
H  -4.850222 0.973367 1.226339
H  -5.453662 -1.905383 0.441509
H  -7.730009 -0.8993 1.040165
H  -6.9266 -1.456418 2.490501
H  -6.923904 0.264709 2.095559
totalener: -965.41427405 hartree
nucrepener: 1782.44219086 hartree
electener: -2747.85646491 hartree
oneelecener: -4851.11162535 hartree
twoeener: 2103.25516043 hartree
kineticenergy: 961.04920872 hartree
xcener: -95.144509344248 hartree
chargesum: 0.0000000
charge: -0.278786 -0.381332 -0.342579 0.127409 -0.021018 -0.095568 -0.272059 -0.259209 -0.240366 0.298681 -0.007939 0.227553 -0.210565 -0.220696 -0.146643 -0.062146 0.004976 0.235471 -0.251822 -0.202895 -0.045858 -0.207388 0.107632 0.086234 0.091218 0.090214 0.085687 0.102315 0.084020 0.085422 0.093555 0.090113 0.078721 0.084636 0.088211 0.092476 0.090886 0.075994 0.083177 0.099840 0.090927 0.095029 0.107694 0.074611 0.126142 0.089994 0.088838 0.069193
qa: -0.2788 -0.3813 -0.3426 0.1274 -0.0210 -0.0956 -0.2721 -0.2592 -0.2404 0.2987 -0.0079 0.2276 -0.2106 -0.2207 -0.1466 -0.0621 0.0050 0.2355 -0.2518 -0.2029 -0.0459 -0.2074 0.1076 0.0862 0.0912 0.0902 0.0857 0.1023 0.0840 0.0854 0.0936 0.0901 0.0787 0.0846 0.0882 0.0925 0.0909 0.0760 0.0832 0.0998 0.0909 0.0950 0.1077 0.0746 0.1261 0.0900 0.0888 0.0692
va: 2.1126 2.1221 2.1479 3.7316 3.8270 3.8241 3.9100 3.9031 3.8969 4.2171 3.7419 3.8047 3.9424 3.9414 3.9406 3.7069 3.5834 4.0568 3.9615 3.9637 3.8401 3.9578 1.0253 1.0317 1.0016 1.0063 1.0051 1.0203 1.0018 1.0027 1.0100 1.0175 1.0096 0.9991 0.9988 1.0029 1.0003 1.0163 1.0276 1.0284 1.0118 1.0015 1.0032 1.0265 1.0348 0.9975 0.9974 1.0112
dispcorr: -0.021731875 hartree
energy: -965.436005928801
dipole: 12.64408 -12.13042 0.51366 4.42067 -3.32167 1.09900 11.16820 -10.14213 1.02607
magnitude: 1.58886 au
magnitude: 4.03856 debye
