program: Orca
programVersion: 5.0.2
elementType: O O O C C C C C C C C C C C C C C C C C C C H H H H H H H H H H H H H H H H H H H H H H H H H H
charge: 0
multiplicity: 1
keywords: wb97x-d3
keywords: def2-TZVPP
keywords: def2/J RIJCOSX
keywords: DEFGRID2
keywords: scfconv7
keywords: smallprint printgap noloewdin
keywords: NOSOSCF
formula: C19H26O3
InChI: InChI=1/C19H26O3/c1-7-8-13-12(4)16(10-15(13)20)22-18(21)17-14(9-11(2)3)19(17,5)6/h7-9,14,16-17H,10H2,1-6H3
48 atoms
O  -0.280353 -0.568774 0.213096
O  0.716045 0.311085 -1.593679
O  -4.356748 -2.616826 0.672356
C  2.669206 1.466543 0.572005
C  3.291225 0.281567 -0.102456
C  1.898259 0.161592 0.479647
C  3.136637 1.861289 1.952587
C  2.279403 2.654415 -0.274225
C  4.394744 -0.493113 0.497621
C  0.748997 -0.006038 -0.433335
C  5.548175 -0.823163 -0.08766
C  -1.478732 -0.852828 -0.508457
C  6.578821 -1.628111 0.646578
C  5.93526 -0.443632 -1.484555
C  -2.076998 -2.166652 -0.025362
C  -2.538489 0.188325 -0.232562
C  -3.699465 -0.373597 0.151156
C  -3.515748 -1.833225 0.316804
C  -2.23581 1.629781 -0.421052
C  -4.992023 0.2345 0.434852
C  -5.538078 1.248791 -0.235683
C  -6.879115 1.829549 0.059262
H  3.296533 0.348603 -1.184822
H  1.808197 -0.382944 1.413208
H  3.362633 1.006336 2.587958
H  4.041258 2.468137 1.887074
H  2.373168 2.453853 2.459481
H  1.995116 2.382204 -1.287478
H  1.444565 3.19649 0.176125
H  3.121086 3.346359 -0.337849
H  4.240113 -0.830189 1.518477
H  -1.258251 -0.874673 -1.579241
H  7.521351 -1.080638 0.72579
H  6.256546 -1.88773 1.654237
H  6.802964 -2.557624 0.117108
H  5.181414 0.14231 -2.004546
H  6.858483 0.140266 -1.479751
H  6.135924 -1.334406 -2.084437
H  -1.564133 -2.528459 0.867612
H  -2.033322 -2.963936 -0.767858
H  -1.300044 1.901106 0.069768
H  -3.023379 2.262585 -0.017712
H  -2.109774 1.867642 -1.480034
H  -5.562748 -0.235023 1.23036
H  -5.006133 1.676976 -1.079861
H  -7.348088 1.349287 0.917175
H  -6.809544 2.899418 0.267415
H  -7.549263 1.721104 -0.796117
totalener: -965.41314875 hartree
nucrepener: 1759.02190865 hartree
electener: -2724.43505740 hartree
oneelecener: -4804.10829056 hartree
twoeener: 2079.67323317 hartree
kineticenergy: 961.04887529 hartree
xcener: -95.144636562906 hartree
chargesum: -0.0000000
charge: -0.277141 -0.387755 -0.323662 0.094120 0.039642 -0.089418 -0.239421 -0.266572 -0.190473 0.308063 -0.049054 0.242051 -0.202494 -0.235887 -0.140816 -0.091734 -0.004254 0.202237 -0.261455 -0.145958 -0.090972 -0.204448 0.092017 0.072431 0.072145 0.092560 0.090828 0.104190 0.077195 0.090181 0.072968 0.097357 0.083849 0.076580 0.085321 0.082614 0.085283 0.087562 0.089516 0.087416 0.094523 0.106797 0.117507 0.097756 0.105567 0.078297 0.084348 0.090596
qa: -0.2771 -0.3878 -0.3237 0.0941 0.0396 -0.0894 -0.2394 -0.2666 -0.1905 0.3081 -0.0491 0.2421 -0.2025 -0.2359 -0.1408 -0.0917 -0.0043 0.2022 -0.2615 -0.1460 -0.0910 -0.2044 0.0920 0.0724 0.0721 0.0926 0.0908 0.1042 0.0772 0.0902 0.0730 0.0974 0.0838 0.0766 0.0853 0.0826 0.0853 0.0876 0.0895 0.0874 0.0945 0.1068 0.1175 0.0978 0.1056 0.0783 0.0843 0.0906
va: 2.1191 2.1065 2.1763 3.7254 3.7867 3.8951 3.9110 3.9090 3.8984 4.2463 3.8209 3.7505 3.9352 3.9463 3.8854 3.7644 3.5003 4.1450 3.9484 3.8829 3.8787 3.9589 1.0350 1.0396 1.0110 1.0042 1.0044 1.0196 1.0047 1.0029 1.0212 1.0287 0.9984 1.0123 0.9984 1.0153 0.9995 0.9990 1.0327 1.0275 1.0099 1.0045 0.9970 1.0298 1.0047 1.0120 0.9987 0.9971
dispcorr: -0.021333318 hartree
energy: -965.434482067683
dipole: 19.47259 -18.46291 1.00967 13.23555 -12.13768 1.09787 1.17371 -1.10546 0.06824
magnitude: 1.49312 au
magnitude: 3.79522 debye
