program: Orca
programVersion: 5.0.2
elementType: O O O C C C C C C C C C C C C C C C C C C C H H H H H H H H H H H H H H H H H H H H H H H H H H
charge: 0
multiplicity: 1
keywords: wb97x-d3
keywords: def2-TZVPP
keywords: def2/J RIJCOSX
keywords: DEFGRID2
keywords: scfconv7
keywords: smallprint printgap noloewdin
keywords: NOSOSCF
formula: C19H26O3
InChI: InChI=1/C19H26O3/c1-7-8-13-12(4)16(10-15(13)20)22-18(21)17-14(9-11(2)3)19(17,5)6/h7-9,14,16-17H,10H2,1-6H3
48 atoms
O  -0.343597 -0.640368 0.153994
O  0.63454 0.137592 -1.708608
O  -4.474959 -2.57095 0.722779
C  2.72917 1.232026 0.353484
C  3.253968 -0.00754 -0.302442
C  1.882365 -0.030865 0.324804
C  3.275971 1.614575 1.707092
C  2.371996 2.422083 -0.503014
C  4.341136 -0.828747 0.290532
C  0.691982 -0.152207 -0.542366
C  5.643927 -0.61328 0.104824
C  -1.575966 -0.889208 -0.520967
C  6.679273 -1.509367 0.713542
C  6.178018 0.516971 -0.72068
C  -2.196821 -2.18391 -0.015798
C  -2.592777 0.183193 -0.208392
C  -3.760556 -0.344594 0.202396
C  -3.618572 -1.810327 0.354488
C  -2.248522 1.615233 -0.396933
C  -5.02538 0.304426 0.51871
C  -5.552704 1.335816 -0.140717
C  -6.863093 1.966908 0.187268
H  3.230968 0.020343 -1.388804
H  1.79392 -0.538925 1.279226
H  3.507494 0.747642 2.324599
H  4.198241 2.18822 1.595894
H  2.560982 2.234821 2.250555
H  2.039465 2.145283 -1.500245
H  1.583082 3.016876 -0.037178
H  3.245233 3.068943 -0.60952
H  4.04018 -1.673826 0.902916
H  -1.396787 -0.917239 -1.599249
H  6.233143 -2.311401 1.300224
H  7.306115 -1.966245 -0.056155
H  7.350182 -0.946984 1.367691
H  6.870957 1.128089 -0.13725
H  6.744428 0.139202 -1.575614
H  5.395287 1.171165 -1.099974
H  -1.67429 -2.549461 0.870171
H  -2.188349 -2.988633 -0.751362
H  -1.285458 1.84928 0.059137
H  -2.998315 2.270492 0.041263
H  -2.156116 1.858919 -1.458138
H  -5.591429 -0.1453 1.328804
H  -5.025711 1.743787 -0.998023
H  -7.549972 1.907194 -0.659384
H  -7.339625 1.48885 1.042127
H  -6.743353 3.027815 0.417437
totalener: -965.41218924 hartree
nucrepener: 1761.67777400 hartree
electener: -2727.08996325 hartree
oneelecener: -4809.44722310 hartree
twoeener: 2082.35725985 hartree
kineticenergy: 961.04853644 hartree
xcener: -95.143107958522 hartree
chargesum: -0.0000000
charge: -0.279751 -0.386781 -0.323425 0.087996 -0.036851 -0.089122 -0.239881 -0.275187 -0.186886 0.315766 -0.029729 0.244080 -0.211244 -0.233450 -0.141176 -0.089074 -0.005882 0.202857 -0.263576 -0.146254 -0.091191 -0.203910 0.110067 0.079615 0.082934 0.086530 0.094292 0.108011 0.082282 0.086472 0.090662 0.097562 0.079619 0.087055 0.084173 0.084792 0.096903 0.080349 0.088816 0.087380 0.094987 0.106625 0.116938 0.097998 0.105508 0.090232 0.078388 0.084485
qa: -0.2798 -0.3868 -0.3234 0.0880 -0.0369 -0.0891 -0.2399 -0.2752 -0.1869 0.3158 -0.0297 0.2441 -0.2112 -0.2335 -0.1412 -0.0891 -0.0059 0.2029 -0.2636 -0.1463 -0.0912 -0.2039 0.1101 0.0796 0.0829 0.0865 0.0943 0.1080 0.0823 0.0865 0.0907 0.0976 0.0796 0.0871 0.0842 0.0848 0.0969 0.0803 0.0888 0.0874 0.0950 0.1066 0.1169 0.0980 0.1055 0.0902 0.0784 0.0845
va: 2.1184 2.1093 2.1766 3.7098 3.8245 3.8829 3.9037 3.9016 3.8526 4.2526 3.7431 3.7475 3.9401 3.9382 3.8860 3.7583 3.5015 4.1452 3.9474 3.8838 3.8790 3.9585 1.0244 1.0364 1.0074 1.0033 1.0052 1.0189 1.0052 1.0037 1.0130 1.0297 1.0106 0.9980 0.9990 1.0005 1.0019 1.0114 1.0324 1.0278 1.0108 1.0042 0.9967 1.0293 1.0048 0.9974 1.0120 0.9985
dispcorr: -0.022180969 hartree
energy: -965.434370212320
dipole: 20.81691 -19.69674 1.12017 14.87112 -13.72232 1.14880 2.19100 -2.07365 0.11735
magnitude: 1.60882 au
magnitude: 4.08929 debye
