program: Orca
programVersion: 5.0.2
elementType: O O O C C C C C C C C C C C C C C C C C C C H H H H H H H H H H H H H H H H H H H H H H H H H H
charge: 0
multiplicity: 1
keywords: wb97x-d3
keywords: def2-TZVPP
keywords: def2/J RIJCOSX
keywords: DEFGRID2
keywords: scfconv7
keywords: smallprint printgap noloewdin
keywords: NOSOSCF
formula: C19H26O3
InChI: InChI=1/C19H26O3/c1-7-8-13-12(4)16(10-15(13)20)22-18(21)17-14(9-11(2)3)19(17,5)6/h7-9,14,16-17H,10H2,1-6H3
48 atoms
O  -0.313279 -0.50472 0.107249
O  0.764383 0.216291 -1.725135
O  -4.311452 -2.639385 0.617363
C  2.697827 1.418515 0.441763
C  3.300601 0.182975 -0.156242
C  1.890267 0.133816 0.384442
C  3.142328 1.856716 1.816223
C  2.367713 2.575618 -0.469273
C  4.360346 -0.594829 0.522075
C  0.756061 -0.032676 -0.548404
C  5.599582 -0.798885 0.071066
C  -1.511891 -0.782799 -0.616788
C  6.576839 -1.629754 0.847007
C  6.13331 -0.239372 -1.212024
C  -2.080438 -2.130223 -0.191759
C  -2.579959 0.225744 -0.265885
C  -3.712496 -0.369552 0.149914
C  -3.500617 -1.831445 0.246983
C  -2.313073 1.67796 -0.422973
C  -4.997632 0.204175 0.52163
C  -5.584874 1.246697 -0.065912
C  -6.917766 1.789257 0.32279
H  3.346713 0.195393 -1.240265
H  1.756268 -0.362239 1.339774
H  3.339415 1.019951 2.484959
H  4.060918 2.442233 1.748468
H  2.380934 2.482663 2.284828
H  2.106569 2.26371 -1.477429
H  1.53519 3.160703 -0.071603
H  3.229941 3.241265 -0.538567
H  4.091414 -1.044481 1.473701
H  -1.303205 -0.744427 -1.689115
H  6.146048 -2.017301 1.769465
H  6.923896 -2.481441 0.256473
H  7.465957 -1.050432 1.108663
H  5.41498 0.375675 -1.750107
H  7.014208 0.379147 -1.020226
H  6.457684 -1.040226 -1.881707
H  -1.51784 -2.552684 0.642701
H  -2.076672 -2.872356 -0.991068
H  -1.326546 1.94179 -0.040049
H  -3.053283 2.281155 0.099176
H  -2.324944 1.963922 -1.47782
H  -5.527833 -0.318455 1.312309
H  -5.096254 1.732294 -0.905462
H  -6.84862 2.841818 0.607515
H  -7.620484 1.737487 -0.511734
H  -7.348439 1.241284 1.16029
totalener: -965.41280228 hartree
nucrepener: 1756.70931608 hartree
electener: -2722.12211836 hartree
oneelecener: -4799.49052649 hartree
twoeener: 2077.36840813 hartree
kineticenergy: 961.04638381 hartree
xcener: -95.143029187148 hartree
chargesum: 0.0000000
charge: -0.279819 -0.386571 -0.323741 0.114811 0.020773 -0.113707 -0.230694 -0.270825 -0.195082 0.318074 -0.036454 0.241548 -0.207258 -0.237621 -0.143585 -0.084936 -0.006886 0.206671 -0.268451 -0.146624 -0.088481 -0.204814 0.094620 0.073410 0.073167 0.090053 0.090896 0.104439 0.078182 0.088839 0.078416 0.098393 0.077300 0.086394 0.083832 0.082727 0.084709 0.088816 0.089091 0.088895 0.095029 0.106769 0.113690 0.097281 0.105030 0.084582 0.090267 0.078847
qa: -0.2798 -0.3866 -0.3237 0.1148 0.0208 -0.1137 -0.2307 -0.2708 -0.1951 0.3181 -0.0365 0.2415 -0.2073 -0.2376 -0.1436 -0.0849 -0.0069 0.2067 -0.2685 -0.1466 -0.0885 -0.2048 0.0946 0.0734 0.0732 0.0901 0.0909 0.1044 0.0782 0.0888 0.0784 0.0984 0.0773 0.0864 0.0838 0.0827 0.0847 0.0888 0.0891 0.0889 0.0950 0.1068 0.1137 0.0973 0.1050 0.0846 0.0903 0.0788
va: 2.1132 2.1125 2.1762 3.7170 3.7834 3.9238 3.9051 3.9098 3.8984 4.2354 3.7906 3.7403 3.9378 3.9484 3.8873 3.7501 3.5109 4.1412 3.9469 3.8835 3.8775 3.9579 1.0320 1.0415 1.0103 1.0055 1.0046 1.0196 1.0047 1.0032 1.0186 1.0321 1.0119 0.9980 0.9986 1.0129 0.9998 0.9994 1.0330 1.0266 1.0124 1.0028 0.9951 1.0308 1.0046 0.9987 0.9972 1.0120
dispcorr: -0.021343934 hartree
energy: -965.434146217771
dipole: 19.59908 -18.64454 0.95454 13.61892 -12.44679 1.17213 2.25183 -2.14022 0.11161
magnitude: 1.51575 au
magnitude: 3.85273 debye
