program: Orca
programVersion: 5.0.2
elementType: O O O C C C C C C C C C C C C C C C C C C C H H H H H H H H H H H H H H H H H H H H H H H H H H
charge: 0
multiplicity: 1
keywords: wb97x-d3
keywords: def2-TZVPP
keywords: def2/J RIJCOSX
keywords: DEFGRID2
keywords: scfconv7
keywords: smallprint printgap noloewdin
keywords: NOSOSCF
formula: C19H26O3
InChI: InChI=1/C19H26O3/c1-7-8-13-12(4)16(10-15(13)20)22-18(21)17-14(9-11(2)3)19(17,5)6/h7-9,14,16-17H,10H2,1-6H3
48 atoms
O  0.047393 0.616105 -0.822736
O  0.492381 2.810825 -0.91942
O  -3.971548 -1.538451 -1.546652
C  3.062049 0.333932 -1.503094
C  2.749801 -0.025784 -0.079955
C  2.292353 1.308773 -0.632397
C  4.466225 0.748102 -1.875559
C  2.373037 -0.43076 -2.607865
C  3.768105 -0.050457 0.986987
C  0.869136 1.67438 -0.812607
C  3.955575 -1.013617 1.892421
C  -1.353703 0.8231 -1.009765
C  5.020185 -0.881844 2.940282
C  3.161447 -2.282094 1.970788
C  -1.941436 -0.273753 -1.880685
C  -2.087309 0.708474 0.301186
C  -3.119069 -0.158936 0.238847
C  -3.150747 -0.773023 -1.110551
C  -1.651924 1.540346 1.452464
C  -4.059095 -0.448787 1.308259
C  -5.080111 -1.308785 1.264459
C  -6.003062 -1.547089 2.410004
H  1.957597 -0.758037 0.019397
H  2.869246 2.173331 -0.322117
H  4.944798 1.364996 -1.116443
H  5.094653 -0.131158 -2.027138
H  4.461597 1.319866 -2.804941
H  1.405462 -0.8289 -2.31324
H  2.224722 0.20026 -3.486458
H  2.994872 -1.274581 -2.91212
H  4.418333 0.817692 1.043091
H  -1.516826 1.815538 -1.438693
H  5.729905 -1.711065 2.888065
H  5.581783 0.046078 2.841678
H  4.587305 -0.906148 3.943605
H  3.821066 -3.149939 1.897499
H  2.652688 -2.361807 2.934416
H  2.409826 -2.37913 1.190901
H  -1.23716 -1.099609 -2.002918
H  -2.224862 0.060384 -2.878746
H  -1.534906 2.583217 1.153819
H  -0.676991 1.208904 1.817727
H  -2.345886 1.499195 2.288396
H  -3.902219 0.098473 2.233237
H  -5.271914 -1.872831 0.361327
H  -5.741945 -0.947711 3.282042
H  -7.03386 -1.31267 2.135281
H  -5.994692 -2.598105 2.706726
totalener: -965.41204703 hartree
nucrepener: 1793.66237761 hartree
electener: -2759.07442463 hartree
oneelecener: -4873.26326048 hartree
twoeener: 2114.18883584 hartree
kineticenergy: 961.04407029 hartree
xcener: -95.145874073902 hartree
chargesum: 0.0000000
charge: -0.285001 -0.362575 -0.342977 0.084392 0.080925 -0.106103 -0.249898 -0.252925 -0.210426 0.331450 -0.048156 0.198671 -0.203724 -0.238374 -0.141402 -0.044734 -0.016231 0.225689 -0.244715 -0.206367 -0.047747 -0.206928 0.080179 0.077160 0.072664 0.092547 0.093450 0.074869 0.094907 0.088830 0.072808 0.104929 0.084229 0.077011 0.084834 0.086586 0.087910 0.081445 0.086443 0.089351 0.115704 0.099832 0.093027 0.075199 0.125328 0.069886 0.089495 0.088534
qa: -0.2850 -0.3626 -0.3430 0.0844 0.0809 -0.1061 -0.2499 -0.2529 -0.2104 0.3315 -0.0482 0.1987 -0.2037 -0.2384 -0.1414 -0.0447 -0.0162 0.2257 -0.2447 -0.2064 -0.0477 -0.2069 0.0802 0.0772 0.0727 0.0925 0.0935 0.0749 0.0949 0.0888 0.0728 0.1049 0.0842 0.0770 0.0848 0.0866 0.0879 0.0814 0.0864 0.0894 0.1157 0.0998 0.0930 0.0752 0.1253 0.0699 0.0895 0.0885
va: 2.0812 2.1411 2.1482 3.7334 3.7160 3.8807 3.9253 3.9196 3.9107 4.2635 3.8206 3.7755 3.9367 3.9472 3.9459 3.6984 3.5638 4.0854 3.9431 3.9756 3.8388 3.9575 1.0349 1.0356 1.0111 1.0033 1.0035 1.0174 1.0021 1.0037 1.0220 1.0309 0.9987 1.0124 0.9980 0.9998 0.9987 1.0142 1.0275 1.0274 1.0077 1.0003 1.0116 1.0280 1.0351 1.0112 0.9974 0.9975
dispcorr: -0.021783167 hartree
energy: -965.433830192919
dipole: 16.35128 -15.35057 1.00071 -7.39324 7.15932 -0.23392 10.84185 -10.08613 0.75572
magnitude: 1.27564 au
magnitude: 3.24242 debye
